di-p-tolyl sulphide
- Formula: C14H14S
- Molecular weight: 214.326
- IUPAC Standard InChIKey: NRXWFTYEJYEOGW-UHFFFAOYSA-N
- CAS Registry Number: 620-94-0
- Chemical structure:
View 3d structure (requires JavaScript / HTML 5) - Species with the same structure:
- Other names: Benzene, 1,1'-thiobis[4-methyl-

Gas phase ion energetics data

Data compiled by: Sharon G. Lias, Rhoda D. Levin, and Sherif A. Kafafi
Ionization energy determinations
IE (eV) | Method | Reference |
---|---|---|
7.83 | CTS | Aloisi, Santini, et al., 1974 |

References

Aloisi, Santini, et al., 1974
Aloisi, G.G.; Santini, S.; Sorriso, S.,
Molecular complexes of substituted diphenyl sulphides with π acceptors. Charge transfer spectra and ionization potentials of the donors,
J. Chem. Soc. Faraday Trans. 1, 1974, 70, 1908. [all data]