Benzonitrile, 3-methyl-
- Formula: C8H7N
- Molecular weight: 117.1479
- IUPAC Standard InChIKey: BOHCMQZJWOGWTA-UHFFFAOYSA-N
- CAS Registry Number: 620-22-4
- Chemical structure:
View 3d structure (requires JavaScript / HTML 5) - Other names: m-Tolunitrile; m-Cyanotoluene; m-Methylbenzonitrile; m-Toluenenitrile; m-Toluonitrile; 3-Methylbenzonitrile; 3-Tolunitrile; meta-Tolunitrile; m-Tolylnitrile; MTN; Nitril kyseliny m-toluylove; 1-Methyl-3-cyanobenzene; 3-Cyanotoluene; 3-Toluenkarbonitril; m-Tolynitrile; NSC 75453

Phase change data

Data compiled as indicated in comments:
TRC - Thermodynamics Research Center, NIST Boulder Laboratories, Chris Muzny director
BS - Robert L. Brown and Stephen E. Stein
AC - William E. Acree, Jr., James S. Chickos
Quantity | Value | Units | Method | Reference | Comment |
---|---|---|---|---|---|
Tboil | 487.3 | K | N/A | Wright, 1961 | Uncertainty assigned by TRC = 0.6 K; TRC |
Tboil | 487.9 | K | N/A | Wright, 1960 | Uncertainty assigned by TRC = 0.5 K; TRC |
Reduced pressure boiling point
Tboil (K) | Pressure (bar) | Reference | Comment |
---|---|---|---|
373.2 | 0.027 | Aldrich Chemical Company Inc., 1990 | BS |
357.7 | 0.013 | Weast and Grasselli, 1989 | BS |
Enthalpy of vaporization
ΔvapH (kJ/mol) | Temperature (K) | Method | Reference | Comment |
---|---|---|---|---|
50.8 | 324. | A | Stephenson and Malanowski, 1987 | Based on data from 309. to 479. K. See also Stull, 1947.; AC |

Reaction thermochemistry data

Data compiled by: John E. Bartmess
Individual Reactions
C8H6N- + =
By formula: C8H6N- + H+ = C8H7N
Quantity | Value | Units | Method | Reference | Comment |
---|---|---|---|---|---|
ΔrH° | 1545. ± 8.8 | kJ/mol | G+TS | Caldwell and Bartmess | gas phase; value altered from reference due to change in acidity scale |
Quantity | Value | Units | Method | Reference | Comment |
ΔrG° | 1515. ± 8.4 | kJ/mol | IMRE | Caldwell and Bartmess | gas phase; value altered from reference due to change in acidity scale |

Gas phase ion energetics data

Data compiled as indicated in comments:
B - John E. Bartmess
LLK - Sharon G. Lias, Rhoda D. Levin, and Sherif A. Kafafi
RDSH - Henry M. Rosenstock, Keith Draxl, Bruce W. Steiner, and John T. Herron
Ionization energy determinations
IE (eV) | Method | Reference | Comment |
---|---|---|---|
9.58 ± 0.05 | EI | Buchs, 1970 | RDSH |
9.66 ± 0.05 | EI | Pignataro, Foffani, et al., 1966 | RDSH |
9.34 | PE | Palmer, Moyes, et al., 1980 | Vertical value; LLK |
9.40 | PE | Kobayashi and Nagakura, 1974 | Vertical value; LLK |
De-protonation reactions
C8H6N- + =
By formula: C8H6N- + H+ = C8H7N
Quantity | Value | Units | Method | Reference | Comment |
---|---|---|---|---|---|
ΔrH° | 1545. ± 8.8 | kJ/mol | G+TS | Caldwell and Bartmess | gas phase; value altered from reference due to change in acidity scale; B |
Quantity | Value | Units | Method | Reference | Comment |
ΔrG° | 1515. ± 8.4 | kJ/mol | IMRE | Caldwell and Bartmess | gas phase; value altered from reference due to change in acidity scale; B |

References

Wright, 1961
Wright, F.J.,
Influence of temperature on viscosity of nonassociated liquids,
J. Chem. Eng. Data, 1961, 6, 454. [all data]
Wright, 1960
Wright, F.J.,
Latent Heat of Vaporization and Composition,
Recl. Trav. Chim. Pays-Bas, 1960, 79, 784-9. [all data]
Aldrich Chemical Company Inc., 1990
Aldrich Chemical Company Inc.,
Catalog Handbook of Fine Chemicals, Aldrich Chemical Company, Inc., Milwaukee WI, 1990, 1. [all data]
Weast and Grasselli, 1989
CRC Handbook of Data on Organic Compounds, 2nd Editon, Weast,R.C and Grasselli, J.G., ed(s)., CRC Press, Inc., Boca Raton, FL, 1989, 1. [all data]
Stephenson and Malanowski, 1987
Stephenson, Richard M.; Malanowski, Stanislaw,
Handbook of the Thermodynamics of Organic Compounds, 1987, https://doi.org/10.1007/978-94-009-3173-2
. [all data]
Stull, 1947
Stull, Daniel R.,
Vapor Pressure of Pure Substances. Organic and Inorganic Compounds,
Ind. Eng. Chem., 1947, 39, 4, 517-540, https://doi.org/10.1021/ie50448a022
. [all data]
Caldwell and Bartmess
Caldwell, G.; Bartmess, J.E.,
, Unpublished results. [all data]
Buchs, 1970
Buchs, A.,
Etude par spectrometrie de masse de l'ionisation de benzonitriles, de phenylacetonitriles et de N,N-dimethylanilines substitues,
Helv. Chim. Acta, 1970, 53, 2026. [all data]
Pignataro, Foffani, et al., 1966
Pignataro, S.; Foffani, A.; Innorta, G.; Distefano, G.,
Molecular structural effects on the ionization potentials for metasubstituted aromatic compounds and for compounds of the type X-CH2-R,
Z. Physik. Chem. (Frankfurt), 1966, 49, 291. [all data]
Palmer, Moyes, et al., 1980
Palmer, M.H.; Moyes, W.; Spiers, M.,
The electronic structure of substituted benzenes: Ab initio calculations and photoelectron spectra for benzonitrile, the tolunitriles, fluorobenzonitriles, dicyanobenzenes and ethynylbenzene,
J. Mol. Struct., 1980, 62, 165. [all data]
Kobayashi and Nagakura, 1974
Kobayashi, T.; Nagakura, S.,
Photoelectron spectra of substituted benzenes,
Bull. Chem. Soc. Jpn., 1974, 47, 2563. [all data]
Bol'shakov, et al., 1969
Bol'shakov, G.F., et al.,
Ultraviolet spectra of heteroorganic compounds, 1969, 175. [all data]