Phenol, 3-ethyl-
- Formula: C8H10O
- Molecular weight: 122.1644
- IUPAC Standard InChIKey: HMNKTRSOROOSPP-UHFFFAOYSA-N
- CAS Registry Number: 620-17-7
- Chemical structure:

Condensed phase thermochemistry data

Data compiled by: Hussein Y. Afeefy, Joel F. Liebman, and Stephen E. Stein
Quantity | Value | Units | Method | Reference | Comment |
---|---|---|---|---|---|
ΔfH°liquid | -214.3 ± 1.6 | kJ/mol | Ccb | Biddiscombe, Handley, et al., 1963 | |
Quantity | Value | Units | Method | Reference | Comment |
ΔcH°liquid | -4362.9 ± 1.5 | kJ/mol | Ccb | Biddiscombe, Handley, et al., 1963 | Corresponding ΔfHºliquid = -214.3 kJ/mol (simple calculation by NIST; no Washburn corrections) |

Phase change data

Data compiled as indicated in comments:
TRC - Thermodynamics Research Center, NIST Boulder Laboratories, Chris Muzny director
BS - Robert L. Brown and Stephen E. Stein
ALS - Hussein Y. Afeefy, Joel F. Liebman, and Stephen E. Stein
DRB - Donald R. Burgess, Jr.
AC - William E. Acree, Jr., James S. Chickos
Quantity | Value | Units | Method | Reference | Comment |
---|---|---|---|---|---|
Tboil | 489. ± 10. | K | AVG | N/A | Average of 8 values; Individual data points |
Quantity | Value | Units | Method | Reference | Comment |
Tfus | 269.1 ± 0.3 | K | AVG | N/A | Average of 8 values; Individual data points |
Quantity | Value | Units | Method | Reference | Comment |
Tc | 716.45 | K | N/A | Ambrose, 1963 | Uncertainty assigned by TRC = 0.15 K; TRC |
Quantity | Value | Units | Method | Reference | Comment |
ΔvapH° | 68.2 ± 0.1 | kJ/mol | V | Biddiscombe, Handley, et al., 1963 | ALS |
ΔvapH° | 68.1 | kJ/mol | N/A | Biddiscombe, Handley, et al., 1963 | DRB |
Reduced pressure boiling point
Tboil (K) | Pressure (bar) | Reference | Comment |
---|---|---|---|
382.2 | 0.020 | Aldrich Chemical Company Inc., 1990 | BS |
Enthalpy of vaporization
ΔvapH (kJ/mol) | Temperature (K) | Method | Reference | Comment |
---|---|---|---|---|
53.1 | 460. | A,GS,EB | Stephenson and Malanowski, 1987 | Based on data from 445. to 503. K. See also Biddiscombe, Handley, et al., 1963, 2.; AC |
68.1 | 292. | A,GS,EB | Stephenson and Malanowski, 1987 | Based on data from 277. to 323. K. See also Biddiscombe, Handley, et al., 1963, 2.; AC |
58.3 | 348. | N/A | Stage, Müller, et al., 1953 | Based on data from 334. to 501. K.; AC |
56.5 | 373. | N/A | Stage, Müller, et al., 1953 | Based on data from 334. to 501. K.; AC |
55.2 | 398. | N/A | Stage, Müller, et al., 1953 | Based on data from 334. to 501. K.; AC |
53.7 | 423. | N/A | Stage, Müller, et al., 1953 | Based on data from 334. to 501. K.; AC |
48.8 | 473. | N/A | Stage, Müller, et al., 1953 | Based on data from 334. to 501. K.; AC |
Antoine Equation Parameters
log10(P) = A − (B / (T + C))
P = vapor pressure (bar)
T = temperature (K)
View plot Requires a JavaScript / HTML 5 canvas capable browser.
Temperature (K) | A | B | C | Reference | Comment |
---|---|---|---|---|---|
445.22 to 502.74 | 4.16397 | 1570.423 | -113.901 | Biddiscombe, Handley, et al., 1963 | Coefficents calculated by NIST from author's data. |
370.3 to 491.4 | 2.78216 | 849.051 | -189.088 | von Terres, Gebert, et al., 1955 | Coefficents calculated by NIST from author's data. |

Gas phase ion energetics data

Data compiled as indicated in comments:
B - John E. Bartmess
RDSH - Henry M. Rosenstock, Keith Draxl, Bruce W. Steiner, and John T. Herron
Appearance energy determinations
Ion | AE (eV) | Other Products | Method | Reference | Comment |
---|---|---|---|---|---|
C7H7O+ | 10.8 ± 0.1 | CH3 | EI | Tait, Shannon, et al., 1962 | RDSH |
De-protonation reactions
C8H9O- + =
By formula: C8H9O- + H+ = C8H10O
Quantity | Value | Units | Method | Reference | Comment |
---|---|---|---|---|---|
ΔrH° | 1461. ± 8.8 | kJ/mol | G+TS | Fujio, McIver, et al., 1981 | gas phase; value altered from reference due to change in acidity scale; B |
Quantity | Value | Units | Method | Reference | Comment |
ΔrG° | 1433. ± 8.4 | kJ/mol | IMRE | Fujio, McIver, et al., 1981 | gas phase; value altered from reference due to change in acidity scale; B |

Gas phase thermochemistry data

Data compiled by: Hussein Y. Afeefy, Joel F. Liebman, and Stephen E. Stein
Quantity | Value | Units | Method | Reference | Comment |
---|---|---|---|---|---|
ΔfH°gas | -146.2 ± 1.7 | kJ/mol | Ccb | Biddiscombe, Handley, et al., 1963 |

Reaction thermochemistry data

Data compiled by: John E. Bartmess
Individual Reactions
C8H9O- + =
By formula: C8H9O- + H+ = C8H10O
Quantity | Value | Units | Method | Reference | Comment |
---|---|---|---|---|---|
ΔrH° | 349.2 ± 2.1 | kcal/mol | G+TS | Fujio, McIver, et al., 1981 | gas phase; value altered from reference due to change in acidity scale |
Quantity | Value | Units | Method | Reference | Comment |
ΔrG° | 342.4 ± 2.0 | kcal/mol | IMRE | Fujio, McIver, et al., 1981 | gas phase; value altered from reference due to change in acidity scale |

Kovats' RI, non-polar column, isothermal

View large format table.

Column type Active phase Temperature (C) I Reference Comment
CapillarySE-30100.1140.Berezkin, Popova, et al., 199730. m/0.25 mm/0.5 μm, He
CapillaryOV-1150.1143.Zhang, Chen, et al., 199725. m/0.2 mm/0.33 μm, N2
CapillaryOV-1150.1143.Zhang, Chen, et al., 199725. m/0.2 mm/0.33 μm, N2
CapillaryOV-1150.1143.Zhang, Chen, et al., 199725. m/0.2 mm/0.33 μm, N2
CapillaryPS-255150.1143.Engewald, Billing, et al., 198850. m/0.30 mm/0.25 μm
PackedMethyl Silicone150.1189.Radecki, Grzybowski, et al., 1979

Kovats' RI, non-polar column, custom temperature program

View large format table.

Column type Active phase I Reference Comment
PackedSE-301160.Grzybowski, Lamparczyk, et al., 1980Chromosorb W HMDS (80-100 mesh); Column length: 2.9 m; Program: not specified

Van Den Dool and Kratz RI, non-polar column, temperature ramp

View large format table.

Column type Active phase I Reference Comment
CapillarySE-541166.Schlutt B., Moran N., et al., 2007He, 40. C @ 2. min, 8. K/min, 240. C @ 5. min; Column length: 50. m; Column diameter: 0.32 mm
CapillarySE-541169.Li, Wang, et al., 1998H2, 35. C @ 3. min, 4. K/min; Column length: 25. m; Column diameter: 0.31 mm; Tend: 250. C
CapillaryOV-11142.7Gautzsch and Zinn, 19968. K/min; Tstart: 35. C; Tend: 300. C
CapillaryDB-51171.Rostad and Pereira, 198630. m/0.26 mm/0.25 μm, He, 50. C @ 4. min, 6. K/min, 300. C @ 20. min

Van Den Dool and Kratz RI, non-polar column, custom temperature program

View large format table.

Column type Active phase I Reference Comment
CapillaryVF-5MS1183.7Tret'yakov, 200730. m/0.25 mm/0.25 μm, He; Program: Multi-step temperature program; T(initial)=60C; T(final)=270C
CapillarySE-541175.Frauendorfer and Schieberle, 200625. m/0.32 mm/0.25 μm, He; Program: 40C(1min) => 40C/min => 60C(1min) => 4C/min => 140C => 20C/min => 240C(5min)
CapillarySE-541169.Schuh and Schieberle, 200630. m/0.32 mm/0.25 μm; Program: 40C(2min) => 6C/min => 150C => 20C/min => 230C
CapillaryDB-5MS1153.Varlet V., Knockaert C., et al., 200630. m/0.32 mm/0.5 μm, He; Program: 70C(1min) => 3C/min => 80C(1min) => 5C/min => 150C => 10C/min => 280C (4min)
CapillarySE-541167.Tairu, Hofmann, et al., 199930. m/0.32 mm/0.25 μm, He; Program: 35C (2min) => 40C/min => 60C (2min) => 6C/min => 180C => 10C/min => 230C (5min)
CapillarySE-541167.Tairu, Hofmann, et al., 1999, 230. m/0.32 mm/0.25 μm, He; Program: 35 0C 40 0C/min -> 60 0C (2 min) 6 0C/min -> 180 0C 10 0C/min -> 230 0C
CapillarySE-541169.Li, Wang, et al., 1998H2; Column length: 25. m; Column diameter: 0.31 mm; Program: not specified

Van Den Dool and Kratz RI, polar column, temperature ramp

View large format table.

Column type Active phase I Reference Comment
CapillaryFFAP2195.Schlutt B., Moran N., et al., 2007He, 40. C @ 2. min, 8. K/min, 240. C @ 5. min; Column length: 30. m; Column diameter: 0.32 mm
CapillarySupelcowax-102189.Chung, Yung, et al., 200160. m/0.25 mm/0.25 μm, He, 35. C @ 5. min, 2. K/min, 195. C @ 90. min
CapillarySupelcowax-102188.Tanchotikul and Hsieh, 198960. m/0.25 mm/0.25 μm, 40. C @ 5. min, 2. K/min, 175. C @ 20. min
CapillarySupelcowax-102189.Tanchotikul and Hsieh, 198960. m/0.25 mm/0.25 μm, 40. C @ 5. min, 2. K/min, 175. C @ 20. min

Van Den Dool and Kratz RI, polar column, custom temperature program

View large format table.

Column type Active phase I Reference Comment
CapillaryFFAP2190.Frauendorfer and Schieberle, 200625. m/0.32 mm/0.2 μm, He; Program: 40C(1min) => 40C/min => 60C(1min) => 6C/min => 180C => 15C/min => 240C
CapillaryFFAP2205.Schuh and Schieberle, 200630. m/0.32 mm/0.25 μm; Program: 40C(2min) => 6C/min => 150C => 20C/min => 230C
CapillaryFFAP2168.Tairu, Hofmann, et al., 199930. m/0.32 mm/0.25 μm, He; Program: 35C (2min) => 40C/min => 60C (2min) => 6C/min => 180C => 10C/min => 230C (5min)

Normal alkane RI, non-polar column, temperature ramp

View large format table.

Column type Active phase I Reference Comment
CapillaryVF-5 MS1138.Souza, Re-Poppi, et al., 201230. m/0.25 mm/0.25 μm, Helium, 60. C @ 1. min, 6. K/min, 280. C @ 3. min
CapillaryDB-51195.Czerny, Brueckner, et al., 201130. m/0.32 mm/0.25 μm, Helium, 40. C @ 2. min, 8. K/min, 250. C @ 5. min
CapillaryDB-51175.Fadel, Mageed, et al., 2006He, 60. C @ 5. min, 4. K/min; Column length: 60. m; Column diameter: 0.32 mm; Tend: 250. C
CapillaryDB-5 MS1176.Schirack, Drake, et al., 200630. m/0.25 mm/0.25 μm, 40. C @ 3. min, 8. K/min, 200. C @ 20. min
CapillaryDB-11135.Lee, Lee, et al., 200560. m/0.32 mm/0.25 μm, He, 35. C @ 4. min, 2. K/min, 230. C @ 25. min
CapillaryDB-11144.Lee, Lee, et al., 200560. m/0.32 mm/0.25 μm, He, 35. C @ 4. min, 2. K/min, 230. C @ 25. min
CapillaryHP-11130.Valette, Fernandez, et al., 200350. m/0.2 mm/0.5 μm, He, 2. K/min, 220. C @ 40. min; Tstart: 60. C
CapillaryDB-51172.Czerny and Schieberle, 200230. m/0.32 mm/0.25 μm, He, 40. C @ 2. min, 6. K/min, 230. C @ 10. min
CapillaryUltra-11139.Okumura, 199125. m/0.32 mm/0.25 μm, He, 3. K/min; Tstart: 80. C; Tend: 260. C

Normal alkane RI, non-polar column, custom temperature program

View large format table.

Column type Active phase I Reference Comment
CapillaryVF-5 MS1138.Souza, Re-Poppi, et al., 201230. m/0.25 mm/0.25 μm, Helium; Program: not specified
CapillaryDB-51170.San-Juan, Petka, et al., 201030. m/0.32 mm/0.50 μm, Hydrogen; Program: 40 0C (5 min) 4 0C/min -> 100 0C 6 0C/min -> 220 0C (20 min)
CapillarySE-541169.Christlbauer and Schieberle, 200930. m/0.32 mm/0.25 μm, Helium; Program: 35 0C (2 min) 10 0C/min -> 50 0C (2 min) 6 0C/min -> 250 0C
CapillarySE-301146.Vinogradov, 2004Program: not specified
CapillaryDB-11176.Alves and Franco, 200330. m/0.25 mm/0.25 μm, H2; Program: 40C(10min) => 2C/min => 110C => 5C/min => 200C(10min)
CapillaryDB-51170.Guth, 199730. m/0.32 mm/0.25 μm; Program: 35C (1min) => 40C/min => 60C (1min) => 6C/min => 250C (10min)
CapillaryDB-11147.Peng, 199630. m/0.53 mm/1.5 μm; Program: 40 0C (4 min) 8 0C/min -> 200 0C (1 min) 5 0C/min -> 280 0C (20 min)
CapillarySE-301160.Peterson, 1992Program: not specified

Normal alkane RI, polar column, temperature ramp

View large format table.

Column type Active phase I Reference Comment
CapillaryDB-FFAP2169.Czerny, Brueckner, et al., 201130. m/0.32 mm/0.25 μm, Helium, 40. C @ 2. min, 8. K/min, 230. C @ 5. min
CapillaryAT-Wax2171.Kiss, Csoka, et al., 201160. m/0.25 mm/0.25 μm, Helium, 4. K/min; Tstart: 60. C; Tend: 280. C
CapillaryDB-Wax2210.Moon and Shibamoto, 201060. m/0.25 mm/0.50 μm, Helium, 40. C @ 5. min, 2. K/min, 210. C @ 70. min
CapillaryFFAP2170.Christlbauer and Schieberle, 200930. m/0.32 mm/0.25 μm, Helium, 40. C @ 2. min, 6. K/min; Tend: 240. C
CapillaryTC-Wax2167.Miyazawa and Okuno, 2003He, 4. K/min, 250. C @ 30. min; Column length: 60. m; Column diameter: 0.25 mm; Tstart: 80. C
CapillaryDB-FFAP2171.Czerny and Schieberle, 200230. m/0.32 mm/0.25 μm, He, 40. C @ 2. min, 6. K/min, 230. C @ 10. min

Normal alkane RI, polar column, custom temperature program

View large format table.

Column type Active phase I Reference Comment
CapillaryDB-Wax2194.San-Juan, Petka, et al., 201030. m/0.32 mm/0.50 μm, Hydrogen; Program: 40 0C (5 min) 4 0C/min -> 100 0C 6 0C/min -> 220 0C (20 min)
CapillaryDB-Wax2194.Ferreira, Juan, et al., 200930. m/0.32 mm/0.50 μm; Program: 40 0C (5 min) 4 0C/min -> 100 0C 6 0C/min -> 220 0C (40 min)
CapillaryDB-Wax2181.Lee, Lee, et al., 200560. m/0.32 mm/0.25 μm, He; Program: 30C(4min) => 2C/min => 170C(25min) => 10C/min => 210C(10min)
CapillaryDB-Wax2191.Lee, Lee, et al., 200560. m/0.32 mm/0.25 μm, He; Program: 30C(4min) => 2C/min => 170C(25min) => 10C/min => 210C(10min)
CapillaryCarbowax 20M2150.Vinogradov, 2004Program: not specified
CapillaryDB-FFAP2170.Guth, 199730. m/0.32 mm/0.25 μm; Program: 35C (1min) => 40C/min => 60C (1min) => 6C/min => 250C (10min)
CapillaryDB-Wax2141.Peng, 199630. m/0.53 mm/1.0 μm; Program: 40 0C (4 min) 4 0C/min -> 200 0C (20 min)
CapillaryDB-Wax2151.Peng, Yang, et al., 1991Program: not specified
CapillaryCarbowax 20M2218.Zimmermann, Lauterbach, et al., 1985Program: not specified

Lee's RI, non-polar column, temperature ramp

View large format table.

Column type Active phase I Reference Comment
CapillaryHP-5197.8Wang, Hou, et al., 200730. m/0.30 mm/0.25 μm, Helium, 50. C @ 5. min, 5. K/min, 200. C @ 15. min
CapillaryHP-5190.6Shao, Wang, et al., 200630. m/0.3 mm/0.25 μm, He, 50. C @ 5. min, 5. K/min, 200. C @ 15. min
CapillaryDB-5194.6Donnelly, Abdel-Hamid, et al., 199330. m/0.32 mm/0.25 μm, He, 40. C @ 3. min, 8. K/min, 285. C @ 29.5 min
CapillaryDB-5196.96Rostad and Pereira, 198630. m/0.26 mm/0.25 μm, He, 50. C @ 4. min, 6. K/min, 300. C @ 20. min

Lee's RI, non-polar column, custom temperature program

View large format table.

Column type Active phase I Reference Comment
CapillaryMethyl Silicone196.80Eckel, Ross, et al., 1993Program: not specified
CapillaryMethyl Silicone196.96Eckel, Ross, et al., 1993Program: not specified

References

Biddiscombe, Handley, et al., 1963
Biddiscombe, D.P.; Handley, R.; Harrop, D.; Head, A.J.; Lewis, G.B.; Martin, J.F.; Sprake, C.H.S.,
Thermodynamic properties of organic oxygen compounds. Part XIII. Preparation and physical properties of pure ethylphenols,
J. Chem. Soc., 1963, 5764-5768. [all data]
Ambrose, 1963
Ambrose, D.,
Critical Temperatures of Some Phenols and Other Organic Compounds,
Trans. Faraday Soc., 1963, 59, 1988. [all data]
Aldrich Chemical Company Inc., 1990
Aldrich Chemical Company Inc.,
Catalog Handbook of Fine Chemicals, Aldrich Chemical Company, Inc., Milwaukee WI, 1990, 1. [all data]
Stephenson and Malanowski, 1987
Stephenson, Richard M.; Malanowski, Stanislaw,
Handbook of the Thermodynamics of Organic Compounds, 1987, https://doi.org/10.1007/978-94-009-3173-2
. [all data]
Biddiscombe, Handley, et al., 1963, 2
Biddiscombe, D.P.; Handley, R.; Harrop, D.; Head, A.J.; Lewis, G.B.; Martin, J.F.; Sprake, C.H.S.,
1099. Thermodynamic properties of organic oxygen compounds. Part XIII. Preparation and physical properties of pure ethylphenols,
J. Chem. Soc., 1963, 5764, https://doi.org/10.1039/jr9630005764
. [all data]
Stage, Müller, et al., 1953
Stage, H.; Müller, E.; Faldix, P.,
Erdol u Kohle, 1953, 6, 375. [all data]
von Terres, Gebert, et al., 1955
von Terres, E.; Gebert, F.; Hulsemann, H.; Petereit, H.; Toepsch, H.; Ruppert, W.,
Zur Kenntnis der physikalisch-chemischen Grundlagen der Gewinnung und Zerlegung der Phenolfraktionen von Steinkohlenteer und Braunkohlenschwelteer. IV. Mitteilung Die Dampfdrucke von Phenol und Phenolderivaten,
Brennst.-Chem., 1955, 36, 272-274. [all data]
Tait, Shannon, et al., 1962
Tait, J.M.S.; Shannon, T.W.; Harrison, A.G.,
The structure of substituted C7 ions from benzyl derivatives at the appearance potential threshold,
J. Am. Chem. Soc., 1962, 84, 4. [all data]
Fujio, McIver, et al., 1981
Fujio, M.; McIver, R.T., Jr.; Taft, R.W.,
Effects on the acidities of phenols from specific substituent-solvent interactions. Inherent substituent parameters from gas phase acidities,
J. Am. Chem. Soc., 1981, 103, 4017. [all data]