m-Xylyl bromide
- Formula: C8H9Br
- Molecular weight: 185.061
- IUPAC Standard InChIKey: FWLWTILKTABGKQ-UHFFFAOYSA-N
- CAS Registry Number: 620-13-3
- Chemical structure:
View 3d structure (requires JavaScript / HTML 5) - Other names: Benzene, 1-(bromomethyl)-3-methyl-; m-Xylene, α-bromo-; α-Bromo-m-xylene; m-Methylbenzyl bromide; 3-Methylbenzyl bromide; m-(Bromomethyl)toluene; 3-(Bromomethyl)toluene; 1-(Bromomethyl)-3-methylbenzene; alpha-Bromo-m-xylene; NSC 60146

Phase change data

Data compiled by: Robert L. Brown and Stephen E. Stein
Quantity | Value | Units | Method | Reference | Comment |
---|---|---|---|---|---|
Tboil | 485.7 | K | N/A | Weast and Grasselli, 1989 |
Reduced pressure boiling point
Tboil (K) | Pressure (bar) | Reference |
---|---|---|
458.2 | 0.453 | Aldrich Chemical Company Inc., 1990 |

Gas phase ion energetics data

Data compiled by: Henry M. Rosenstock, Keith Draxl, Bruce W. Steiner, and John T. Herron
Appearance energy determinations
Ion | AE (eV) | Other Products | Method | Reference | Comment |
---|---|---|---|---|---|
C8H9+ | 9.4 ± 0.1 | Br | EI | Tait, Shannon, et al., 1962 |

References

Weast and Grasselli, 1989
CRC Handbook of Data on Organic Compounds, 2nd Editon, Weast,R.C and Grasselli, J.G., ed(s)., CRC Press, Inc., Boca Raton, FL, 1989, 1. [all data]
Aldrich Chemical Company Inc., 1990
Aldrich Chemical Company Inc.,
Catalog Handbook of Fine Chemicals, Aldrich Chemical Company, Inc., Milwaukee WI, 1990, 1. [all data]
Tait, Shannon, et al., 1962
Tait, J.M.S.; Shannon, T.W.; Harrison, A.G.,
The structure of substituted C7 ions from benzyl derivatives at the appearance potential threshold,
J. Am. Chem. Soc., 1962, 84, 4. [all data]