Benzoic acid, 4-cyano-
- Formula: C8H5NO2
- Molecular weight: 147.1308
- IUPAC Standard InChIKey: ADCUEPOHPCPMCE-UHFFFAOYSA-N
- CAS Registry Number: 619-65-8
- Chemical structure:
View 3d structure (requires JavaScript / HTML 5) - Other names: Benzoic acid, p-cyano-; p-Carboxybenzonitrile; p-Cyanobenzoic acid; 4-Cyanobenzoic acid; Terephthalic mononitrile; 4-Carboxybenzonitrile

Phase change data

Data compiled by: William E. Acree, Jr., James S. Chickos
Quantity | Value | Units | Method | Reference | Comment |
---|---|---|---|---|---|
ΔsubH° | 112.8 ± 0.4 | kJ/mol | N/A | Ribeiro da Silva, Amaral, et al., 2008 |

Reaction thermochemistry data

Data compiled by: John E. Bartmess
Individual Reactions
C8H4NO2- + =
By formula: C8H4NO2- + H+ = C8H5NO2
Quantity | Value | Units | Method | Reference | Comment |
---|---|---|---|---|---|
ΔrH° | 1372. ± 8.8 | kJ/mol | G+TS | Kebarle and McMahon, 1977 | gas phase |
Quantity | Value | Units | Method | Reference | Comment |
ΔrG° | 1342. ± 8.4 | kJ/mol | IMRE | Kebarle and McMahon, 1977 | gas phase |

Gas phase ion energetics data

Data compiled as indicated in comments:
B - John E. Bartmess
LBLHLM - Sharon G. Lias, John E. Bartmess, Joel F. Liebman, John L. Holmes, Rhoda D. Levin, and W. Gary Mallard
LLK - Sharon G. Lias, Rhoda D. Levin, and Sherif A. Kafafi
Ionization energy determinations
IE (eV) | Method | Reference | Comment |
---|---|---|---|
10.0 | EI | Tobita, Tajima, et al., 1984 | LBLHLM |
10.3 ± 0.2 | EI | Benoit, 1973 | LLK |
Appearance energy determinations
Ion | AE (eV) | Other Products | Method | Reference | Comment |
---|---|---|---|---|---|
C7H4N+ | 15.7 ± 0.2 | CO+OH | EI | Benoit, 1973 | LLK |
C8H4NO+ | 12.7 ± 0.2 | OH | EI | Benoit, 1973 | LLK |
De-protonation reactions
C8H4NO2- + =
By formula: C8H4NO2- + H+ = C8H5NO2
Quantity | Value | Units | Method | Reference | Comment |
---|---|---|---|---|---|
ΔrH° | 1372. ± 8.8 | kJ/mol | G+TS | Kebarle and McMahon, 1977 | gas phase; B |
Quantity | Value | Units | Method | Reference | Comment |
ΔrG° | 1342. ± 8.4 | kJ/mol | IMRE | Kebarle and McMahon, 1977 | gas phase; B |

References

Ribeiro da Silva, Amaral, et al., 2008
Ribeiro da Silva, Manuel A.V.; Amaral, Luísa M.P.F.; Boaventura, Cristina R.P.; Gomes, José R.B.,
Standard molar enthalpies of formation of 2-, 3- and 4-cyanobenzoic acids,
The Journal of Chemical Thermodynamics, 2008, 40, 8, 1226-1231, https://doi.org/10.1016/j.jct.2008.04.004
. [all data]
Kebarle and McMahon, 1977
Kebarle, P.; McMahon, T.B.,
Intrinsic Acidities of Substituted Phenols and Benzoic Acids Determined by Gas Phase Proton Transfer Equilibria,
J. Am. Chem. Soc., 1977, 99, 7, 2222, https://doi.org/10.1021/ja00449a032
. [all data]
Tobita, Tajima, et al., 1984
Tobita, S.; Tajima, S.; Tsuchiya, T.,
The substituent effect on the single and double hydrogen atom transfer reactions in para-substituted benzoic acid isobutyl esters,
Org. Mass Spectrom., 1984, 19, 326. [all data]
Benoit, 1973
Benoit, F.,
Substituent effects in mass spectrometry. III. Substituent effects in the dissociation of the molecular ions of para and meta subtituted benzoic acids,
Org. Mass Spectrom., 1973, 7, 295. [all data]