Benzoic acid, 4-amino-, methyl ester
- Formula: C8H9NO2
- Molecular weight: 151.1626
- IUPAC Standard InChIKey: LZXXNPOYQCLXRS-UHFFFAOYSA-N
- CAS Registry Number: 619-45-4
- Chemical structure:
View 3d structure (requires JavaScript / HTML 5) - Other names: Benzoic acid, p-amino-, methyl ester; p-(Methoxycarbonyl)aniline; p-Aminobenzoic acid methyl ester; Methyl aniline-4-carboxylate; Methyl p-aminobenzoate; Methyl 4-aminobenzoate; 4-(Methoxycarbonyl)aniline; 4-Aminobenzoic acid methyl ester; Methyl ester of p-aminobenzoic acid; Methyl ester of 4-aminobenzoic acid; 4-(Carbomethoxy)aniline; NSC 3783

Phase change data

Data compiled as indicated in comments:
TRC - Thermodynamics Research Center, NIST Boulder Laboratories, Chris Muzny director
AC - William E. Acree, Jr., James S. Chickos
Quantity | Value | Units | Method | Reference | Comment |
---|---|---|---|---|---|
Tfus | 384.3 | K | N/A | Manzo and Ahumanda, 1990 | Uncertainty assigned by TRC = 0.5 K; TRC |
Tfus | 385.1 | K | N/A | Neau, Flynn, et al., 1989 | Uncertainty assigned by TRC = 0.5 K; TRC |
Tfus | 385.7 | K | N/A | Schwartz and Paruta, 1976 | Uncertainty assigned by TRC = 0.5 K; TRC |
Tfus | 385. | K | N/A | Yalkowsky, Flynn, et al., 1972 | Uncertainty assigned by TRC = 1. K; TRC |
Enthalpy of fusion
ΔfusH (kJ/mol) | Temperature (K) | Reference | Comment |
---|---|---|---|
22.55 | 385.1 | Manzo and Ahumada, 1990 | AC |

Gas phase ion energetics data

Data evaluated as indicated in comments:
HL - Edward P. Hunter and Sharon G. Lias
Data compiled as indicated in comments:
B - John E. Bartmess
LLK - Sharon G. Lias, Rhoda D. Levin, and Sherif A. Kafafi
RDSH - Henry M. Rosenstock, Keith Draxl, Bruce W. Steiner, and John T. Herron
Quantity | Value | Units | Method | Reference | Comment |
---|---|---|---|---|---|
Proton affinity (review) | 883.9 | kJ/mol | N/A | Hunter and Lias, 1998 | HL |
Quantity | Value | Units | Method | Reference | Comment |
Gas basicity | 853.0 | kJ/mol | N/A | Hunter and Lias, 1998 | HL |
Ionization energy determinations
IE (eV) | Method | Reference | Comment |
---|---|---|---|
7.7 | PE | Meeks, Wahlborg, et al., 1981 | LLK |
8.08 ± 0.01 | EI | Foffani, Pignataro, et al., 1964 | RDSH |
8.1 | PE | Meeks, Wahlborg, et al., 1981 | Vertical value; LLK |
Appearance energy determinations
Ion | AE (eV) | Other Products | Method | Reference | Comment |
---|---|---|---|---|---|
C7H6NO+ | 10.91 | CH3O | EI | Howe and Williams, 1969 | RDSH |
De-protonation reactions
C8H8NO2- + =
By formula: C8H8NO2- + H+ = C8H9NO2
Quantity | Value | Units | Method | Reference | Comment |
---|---|---|---|---|---|
ΔrH° | 1475. ± 8.8 | kJ/mol | G+TS | Taft and Topsom, 1987 | gas phase; value altered from reference due to change in acidity scale; B |
Quantity | Value | Units | Method | Reference | Comment |
ΔrG° | 1444. ± 8.4 | kJ/mol | IMRE | Taft and Topsom, 1987 | gas phase; value altered from reference due to change in acidity scale; B |

Reaction thermochemistry data

Data compiled by: John E. Bartmess
Individual Reactions
C8H8NO2- + =
By formula: C8H8NO2- + H+ = C8H9NO2
Quantity | Value | Units | Method | Reference | Comment |
---|---|---|---|---|---|
ΔrH° | 352.5 ± 2.1 | kcal/mol | G+TS | Taft and Topsom, 1987 | gas phase; value altered from reference due to change in acidity scale |
Quantity | Value | Units | Method | Reference | Comment |
ΔrG° | 345.2 ± 2.0 | kcal/mol | IMRE | Taft and Topsom, 1987 | gas phase; value altered from reference due to change in acidity scale |

References

Manzo and Ahumanda, 1990
Manzo, R.H.; Ahumanda, A.A.,
Effects of solvent medium on solubility. V: Enthalpic and entropic contributions to the free energy changes of Di-substituted benzene derivatives in ethanol: Water and ethanol: Cyclohexane mixtures,
J. Pharm. Sci., 1990, 79, 12, 1109, https://doi.org/10.1002/jps.2600791214
. [all data]
Neau, Flynn, et al., 1989
Neau, S.H.; Flynn, G.L.; Yalkowsky, S.H.,
Int. J. Pharm., 1989, 49, 223. [all data]
Schwartz and Paruta, 1976
Schwartz, P.A.; Paruta, A.N.,
Solution thermodynamics of alkyl p-aminobenzoates,
J. Pharm. Sci., 1976, 65, 252. [all data]
Yalkowsky, Flynn, et al., 1972
Yalkowsky, S.H.; Flynn, G.L.; Slunick, T.G.,
Importance of chain length on physicochemical and crystalline properties of organic homologs,
J. Pharm. Sci., 1972, 61, 852. [all data]
Manzo and Ahumada, 1990
Manzo, Ruben H.; Ahumada, Amelia A.,
Effects of solvent medium on solubility. V: Enthalpic and entropic contributions to the free energy changes of Di-substituted benzene derivatives in ethanol: Water and ethanol: Cyclohexane mixtures,
J. Pharm. Sci., 1990, 79, 12, 1109-1115, https://doi.org/10.1002/jps.2600791214
. [all data]
Hunter and Lias, 1998
Hunter, E.P.; Lias, S.G.,
Evaluated Gas Phase Basicities and Proton Affinities of Molecules: An Update,
J. Phys. Chem. Ref. Data, 1998, 27, 3, 413-656, https://doi.org/10.1063/1.556018
. [all data]
Meeks, Wahlborg, et al., 1981
Meeks, J.; Wahlborg, A.; McGlynn, S.P.,
Photoelectron spectroscopy of carbonyls: Benzoic acid and its derivatives,
J. Electron Spectrosc. Relat. Phenom., 1981, 22, 43. [all data]
Foffani, Pignataro, et al., 1964
Foffani, A.; Pignataro, S.; Cantone, B.; Grasso, F.,
Ionization potentials and substituent effects for aromatic carbonyl compounds,
Z. Physik. Chem. (Frankfurt), 1964, 42, 221. [all data]
Howe and Williams, 1969
Howe, I.; Williams, D.H.,
Calculation and qualitative predictions of mass spectra. Mono- and paradisubstituted benzenes,
J. Am. Chem. Soc., 1969, 91, 7137. [all data]
Taft and Topsom, 1987
Taft, R.W.; Topsom, R.D.,
The Nature and Analysis of Substituent Effects,
Prog. Phys. Org. Chem., 1987, 16, 1. [all data]