1-Buten-2-ol
- Formula: C4H8O
- Molecular weight: 72.1057
- IUPAC Standard InChIKey: IKZZIQXKLWDPCD-UHFFFAOYSA-N
- CAS Registry Number: 61923-55-5
- Chemical structure:
View 3d structure (requires JavaScript / HTML 5) - Permanent link for this species. Use this link for bookmarking this species for future reference.

Gas phase ion energetics data

Data compiled as indicated in comments:
LBLHLM - Sharon G. Lias, John E. Bartmess, Joel F. Liebman, John L. Holmes, Rhoda D. Levin, and W. Gary Mallard
Ionization energy determinations
IE (eV) | Method | Reference | Comment |
---|---|---|---|
8.6 ± 0.1 | EI | Iraqi, Pri-Bar, et al., 1986 | LBLHLM |
8.36 ± 0.05 | EI | Holmes and Lossing, 1983 | LBLHLM |
Appearance energy determinations
Ion | AE (eV) | Other Products | Method | Reference | Comment |
---|---|---|---|---|---|
C2H3O+ | 10.4 ± 0.1 | C2H5 | EI | Iraqi, Pri-Bar, et al., 1986 | LBLHLM |
C3H5O+ | 10.3 ± 0.1 | CH3 | EI | Iraqi, Pri-Bar, et al., 1986 | LBLHLM |

References

Iraqi, Pri-Bar, et al., 1986
Iraqi, M.; Pri-Bar, I.; Lifshitz, C.,
Electron impact ionization of unstable enols: H2C=CHOH, H2C=C(OH)-CH3 and H2C=C(OH)-C2H5,
Org. Mass Spectrom., 1986, 21, 661. [all data]
Holmes and Lossing, 1983
Holmes, J.L.; Lossing, F.P.,
The need for adequate thermochemical data for the interpretation of fragmentation mechanisms and ion structure assignments,
Int. J. Mass Spectrom. Ion Phys., 1983, 47, 133. [all data]