2,5-Dinitroaniline
- Formula: C6H5N3O4
- Molecular weight: 183.1216
- IUPAC Standard InChIKey: RZKBRXDCJZLQLI-UHFFFAOYSA-N
- CAS Registry Number: 619-18-1
- Chemical structure:
View 3d structure (requires JavaScript / HTML 5) - Permanent link for this species. Use this link for bookmarking this species for future reference.

Condensed phase thermochemistry data

Data compiled by: Hussein Y. Afeefy, Joel F. Liebman, and Stephen E. Stein
Quantity | Value | Units | Method | Reference | Comment |
---|---|---|---|---|---|
ΔfH°solid | -44.4 | kJ/mol | Ccb | Macharacek, Zacharov, et al., 1962 | |
Quantity | Value | Units | Method | Reference | Comment |
ΔcH°solid | -3031. | kJ/mol | Ccb | Macharacek, Zacharov, et al., 1962 |

Gas phase ion energetics data

Data compiled by: Sharon G. Lias, Rhoda D. Levin, and Sherif A. Kafafi
Ionization energy determinations
IE (eV) | Method | Reference |
---|---|---|
8.89 ± 0.01 | PI | Potapov, Kardash, et al., 1972 |

References

Macharacek, Zacharov, et al., 1962
Macharacek, K.; Zacharov, A.I.; Aljosina, L.A.,
Spalna a slucovaci tepla izomernich dinitroanilinu,
Chem. Prumsyl., 1962, 12, 23-24. [all data]
Potapov, Kardash, et al., 1972
Potapov, V.K.; Kardash, I.E.; Sorokin, V.V.; Sokolov, S.A.; Evlasheva, T.I.,
Photoionization of heteroaromatic compounds,
Khim. Vys. Energ., 1972, 6, 392. [all data]