Leucine
- Formula: C6H13NO2
- Molecular weight: 131.1729
- IUPAC Standard InChIKey: ROHFNLRQFUQHCH-RXMQYKEDSA-N
- CAS Registry Number: 61-90-5
- Chemical structure:
- Other names: L-Leucine; Leucine, L-; L-α-Aminoisocaproic acid; α-Amino-γ-methylvaleric acid; (S)-(+)-Leucine; L-(+)-Leucine; Leu; Pentanoic acid, 2-amino-4-methyl-, (S)-; 2-Amino-4-methylpentanoic acid, (L)-; 2-Amino-4-methylvaleric acid, (L)-; iso-C4H9CH(NH2)COOH; L-(-)-2-Amino-4-methylpentanoic acid; Norvaline, 4-methyl-, (L)-; Valeric acid, 2-amino-4-methyl-, (S)-; Leucin; (S)-2-Amino-4-methylpentanoic acid; (S)-Leucine; (S)-2-Amino-4-methylvaleric acid; L-Norvaline, 4-methyl-; NSC 46709

Gas phase thermochemistry data

Data compiled by: Hussein Y. Afeefy, Joel F. Liebman, and Stephen E. Stein
Quantity | Value | Units | Method | Reference | Comment |
---|---|---|---|---|---|
ΔcH°gas | -3570.0 ± 1.9 | kJ/mol | Ccb | Wu, Zhu, et al., 1993 |

Condensed phase thermochemistry data

Data compiled as indicated in comments:
ALS - Hussein Y. Afeefy, Joel F. Liebman, and Stephen E. Stein
DH - Eugene S. Domalski and Elizabeth D. Hearing
Quantity | Value | Units | Method | Reference | Comment |
---|---|---|---|---|---|
ΔfH°liquid | -648.9 ± 2.0 | kJ/mol | Ccb | Wu, Zhu, et al., 1993 | ALS |
Quantity | Value | Units | Method | Reference | Comment |
ΔfH°solid | -646.8 | kJ/mol | Ccb | Hutchens, Cole, et al., 1963 | Heat of combustion is not reported; ALS |
ΔfH°solid | -637.39 ± 0.92 | kJ/mol | Ccb | Huffman, Fox, et al., 1937 | Reanalyzed by Pedley, Naylor, et al., 1986, Original value = -642.20 kJ/mol; ALS |
Quantity | Value | Units | Method | Reference | Comment |
ΔcH°solid | -3572.0 ± 0.3 | kJ/mol | Ccb | Tsuzuki and Hunt, 1957 | Reanalyzed by Cox and Pilcher, 1970, Original value = -3569.3 ± 0.3 kJ/mol; ALS |
ΔcH°solid | -3581.5 ± 0.84 | kJ/mol | Ccb | Huffman, Fox, et al., 1937 | Reanalyzed by Pedley, Naylor, et al., 1986, Original value = -3581.4 ± 0.84 kJ/mol; ALS |
ΔcH°solid | -3596. | kJ/mol | Ccb | Fischer and Wrede, 1904 | Heat of combustion corrected for pressure; ALS |
ΔcH°solid | -3600.4 | kJ/mol | Ccb | Lemoult, 1904 | ALS |
Quantity | Value | Units | Method | Reference | Comment |
S°solid,1 bar | 211.79 | J/mol*K | N/A | Hutchens, Cole, et al., 1963 | DH |
Constant pressure heat capacity of solid
Cp,solid (J/mol*K) | Temperature (K) | Reference | Comment |
---|---|---|---|
191. | 298. | Badelin, Kulikov, et al., 1990 | T = 298, 313, 333, 348 K.; DH |
190.6 | 298. | Kulikov, Kozlov, et al., 1989 | T = 298 to 348 K.; DH |
201.4 | 298.15 | Spink and Wads, 1975 | DH |
200.96 | 298.15 | Hutchens, Cole, et al., 1963 | T = 11 to 310 K.; DH |

Phase change data

Data compiled as indicated in comments:
AC - William E. Acree, Jr., James S. Chickos
ALS - Hussein Y. Afeefy, Joel F. Liebman, and Stephen E. Stein
DH - Eugene S. Domalski and Elizabeth D. Hearing
Enthalpy of sublimation
ΔsubH (kJ/mol) | Temperature (K) | Method | Reference | Comment |
---|---|---|---|---|
148.7 ± 6.5 | 401. to 517. | TGA | Lähde, Raula, et al., 2009 | AC |
151. ± 0.8 | 455. | V | Svec and Clyde, 1965 | ALS |
150.6 ± 0.8 | 455. | ME | Svec and Clyde, 1965, 2 | Based on data from 446. to 464. K. See also Cox and Pilcher, 1970, 2 and Clyde and Svec, 1964.; AC |
Enthalpy of phase transition
ΔHtrs (kJ/mol) | Temperature (K) | Initial Phase | Final Phase | Reference | Comment |
---|---|---|---|---|---|
0.200 | 352. | crystaline, II | crystaline, I | Grunenberg, Bougeard, et al., 1984 | DH |
Entropy of phase transition
ΔStrs (J/mol*K) | Temperature (K) | Initial Phase | Final Phase | Reference | Comment |
---|---|---|---|---|---|
0.57 | 352. | crystaline, II | crystaline, I | Grunenberg, Bougeard, et al., 1984 | DH |

Gas phase ion energetics data

Data evaluated as indicated in comments:
HL - Edward P. Hunter and Sharon G. Lias
Data compiled as indicated in comments:
B - John E. Bartmess
LLK - Sharon G. Lias, Rhoda D. Levin, and Sherif A. Kafafi
RDSH - Henry M. Rosenstock, Keith Draxl, Bruce W. Steiner, and John T. Herron
Quantity | Value | Units | Method | Reference | Comment |
---|---|---|---|---|---|
Proton affinity (review) | 914.6 | kJ/mol | N/A | Hunter and Lias, 1998 | HL |
Quantity | Value | Units | Method | Reference | Comment |
Gas basicity | 880.6 | kJ/mol | N/A | Hunter and Lias, 1998 | HL |
Ionization energy determinations
IE (eV) | Method | Reference | Comment |
---|---|---|---|
8.51 | PE | Klasinc, 1976 | LLK |
Appearance energy determinations
Ion | AE (eV) | Other Products | Method | Reference | Comment |
---|---|---|---|---|---|
C5H12N+ | 9.9 ± 0.2 | ? | EI | Junk and Svec, 1963 | RDSH |
De-protonation reactions
C6H12NO2- + =
By formula: C6H12NO2- + H+ = C6H13NO2
Quantity | Value | Units | Method | Reference | Comment |
---|---|---|---|---|---|
ΔrH° | 1419. ± 10. | kJ/mol | CIDC | Jones, Bernier, et al., 2007 | gas phase; B |
ΔrH° | 1418. ± 13. | kJ/mol | G+TS | O'Hair, Bowie, et al., 1992 | gas phase; B |
Quantity | Value | Units | Method | Reference | Comment |
ΔrG° | 1390. ± 13. | kJ/mol | CIDC | O'Hair, Bowie, et al., 1992 | gas phase; B |

Reaction thermochemistry data

Data compiled by: John E. Bartmess

Individual Reactions

C6H12NO2- + Hydrogen cation = Leucine

By formula: C6H12NO2- + H+ = C6H13NO2

Quantity Value Units Method Reference Comment
Δr1419. ± 10.kJ/molCIDCJones, Bernier, et al., 2007gas phase
Δr1418. ± 13.kJ/molG+TSO'Hair, Bowie, et al., 1992gas phase
Quantity Value Units Method Reference Comment
Δr1390. ± 13.kJ/molCIDCO'Hair, Bowie, et al., 1992gas phase

References

Wu, Zhu, et al., 1993
Wu, D.; Zhu, Y.; Gao, Z.; Qu, S.,
Determination of combustion heat of some amino acids,
Wuhan Daxue Xuebao Ziran Kexueban, 1993, 78-82. [all data]
Hutchens, Cole, et al., 1963
Hutchens, J.O.; Cole, A.G.; Stout, J.W.,
Heat capacities from 11 to 305°K., entropies, and free energies of formation of L-valine, L-isoleucine, and L-leucine,
J. Phys. Chem., 1963, 67, 1128-1130. [all data]
Huffman, Fox, et al., 1937
Huffman, H.M.; Fox, S.W.; Ellis, E.L.,
Thermal data. VII. The heats of combustion of seven amino acids,
J. Am. Chem. Soc., 1937, 59, 2144-21. [all data]
Pedley, Naylor, et al., 1986
Pedley, J.B.; Naylor, R.D.; Kirby, S.P.,
Thermochemical Data of Organic Compounds, Chapman and Hall, New York, 1986, 1-792. [all data]
Tsuzuki and Hunt, 1957
Tsuzuki, T.; Hunt, H.,
Heats of combustion. VI. The heats of combustion of some amino acids,
J. Phys. Chem., 1957, 61, 1668. [all data]
Cox and Pilcher, 1970
Cox, J.D.; Pilcher, G.,
Thermochemistry of Organic and Organometallic Compounds, Academic Press, New York, 1970, 1-636. [all data]
Fischer and Wrede, 1904
Fischer, E.; Wrede, F.,
Uber die Verbrennungswarme einiger organischer Verbindungen,
Sitzungsber. Dtsch. Akad. Wiss. Berlin Kl. Math. Phys. Tech., 1904, 687-715. [all data]
Lemoult, 1904
Lemoult, M.P.,
Remarques sur une serie recenie de determinations calorimetriques,
Compt. Rend., 1904, 663-635. [all data]
Badelin, Kulikov, et al., 1990
Badelin, V.G.; Kulikov, O.V.; Batagin, V.S.; Udzig, E.; Zielenkiewicz, A.; Zielenkiewicz, W.; Krestov, G.A.,
Physico-chemical properties of peptides and their solutions,
Thermochim. Acta, 1990, 169, 81-93. [all data]
Kulikov, Kozlov, et al., 1989
Kulikov, O.V.; Kozlov, V.A.; Malenkina, L.I.; Badelin, V.G.,
Heat capacities of amino acids and peptides and excess characteristics ot their aqueous solutions, Sbornik Nauch. Trud., Termodin. Rast. neelect., Ivanovo,
Inst. nevod. rast., 1989, Akad. [all data]
Spink and Wads, 1975
Spink, C.H.; Wads, I.,
Thermochemistry of solutions of biochemical model compounds. 4. The partial molar heat capacities of some amino acids in aqueous solution,
J. Chem. Thermodynam., 1975, 7, 561-572. [all data]
Lähde, Raula, et al., 2009
Lähde, Anna; Raula, Janne; Malm, Jari; Kauppinen, Esko I.; Karppinen, Maarit,
Sublimation and vapour pressure estimation of l-leucine using thermogravimetric analysis,
Thermochimica Acta, 2009, 482, 1-2, 17-20, https://doi.org/10.1016/j.tca.2008.10.009
. [all data]
Svec and Clyde, 1965
Svec, H.J.; Clyde, D.D.,
Vapor pressures of some α-amino acids,
J. Chem. Eng. Data, 1965, 10, 151. [all data]
Svec and Clyde, 1965, 2
Svec, H.J.; Clyde, D.D.,
Vapor Pressures of Some α-Amino Acids.,
J. Chem. Eng. Data, 1965, 10, 2, 151-152, https://doi.org/10.1021/je60025a024
. [all data]
Cox and Pilcher, 1970, 2
Cox, J.D.; Pilcher, G.,
Thermochemistry of Organic and Organometallic Compounds, Academic Press Inc., London, 1970, 643. [all data]
Clyde and Svec, 1964
Clyde, D.D.; Svec, H.,
, U. S. Atomic Energy Comm. IS-790, 1964, 1. [all data]
Grunenberg, Bougeard, et al., 1984
Grunenberg, A.; Bougeard, D.; Schrader, B.,
DSC-investigations of 22 crystalline neutral aliphatic amino acids in the temperature range 233 to 423 K,
Thermochim. Acta, 1984, 77, 59-66. [all data]
Hunter and Lias, 1998
Hunter, E.P.; Lias, S.G.,
Evaluated Gas Phase Basicities and Proton Affinities of Molecules: An Update,
J. Phys. Chem. Ref. Data, 1998, 27, 3, 413-656, https://doi.org/10.1063/1.556018
. [all data]
Klasinc, 1976
Klasinc, L.,
Application of photoelectron spectroscopy to biologically active molecules and their constituent parts,
J. Electron Spectrosc. Relat. Phenom., 1976, 8, 161. [all data]
Junk and Svec, 1963
Junk, G.; Svec, H.,
The mass spectra of the α-amino acids,
J. Am. Chem. Soc., 1963, 85, 839. [all data]
Jones, Bernier, et al., 2007
Jones, C.M.; Bernier, M.; Carson, E.; Colyer, K.E.; Metz, R.; Pawlow, A.; Wischow, E.D.; Webb, I.; Andriole, E.J.; Poutsma, J.C.,
Gas-phase Acities of the 20 Protein Amino Acids,
Int. J. Mass Spectrom., 2007, 267, 1-3, 54-62, https://doi.org/10.1016/j.ijms.2007.02.018
. [all data]
O'Hair, Bowie, et al., 1992
O'Hair, R.J.; Bowie, J.H.; Gronert, S.,
Gas Phase Acidity of the alpha-Amino Acids,
Int. J. Mass Spectrom. Ion Proc., 1992, 117, 23, https://doi.org/10.1016/0168-1176(92)80083-D
. [all data]