Bicyclo[4.1.1]oct-3-ene
- Formula: C8H12
- Molecular weight: 108.1809
- IUPAC Standard InChIKey: IBJMNXAEDQNPFI-UHFFFAOYSA-N
- CAS Registry Number: 61885-54-9
- Chemical structure:
View 3d structure (requires JavaScript / HTML 5) - Permanent link for this species. Use this link for bookmarking this species for future reference.

Gas phase ion energetics data

Data compiled by: Sharon G. Lias, Rhoda D. Levin, and Sherif A. Kafafi
Ionization energy determinations
IE (eV) | Method | Reference | Comment |
---|---|---|---|
8.90 | PE | Gleiter, Bischof, et al., 1977 | Vertical value |

References

Gleiter, Bischof, et al., 1977
Gleiter, R.; Bischof, P.; Volz, W.E.; Paquette, L.A.,
Conjugative interaction between II cyclobutane orbitals. The synthesis and electronic structure of bicyclo[4.1.1]octa-2,4-diene,
J. Am. Chem. Soc., 1977, 99, 8. [all data]