3,3,5,5-Tetramethylheptane
- Formula: C11H24
- Molecular weight: 156.3083
- IUPAC Standard InChIKey: GALDMESQGNRJGE-UHFFFAOYSA-N
- CAS Registry Number: 61868-61-9
- Chemical structure:
View 3d structure (requires JavaScript / HTML 5) - Permanent link for this species. Use this link for bookmarking this species for future reference.

Condensed phase thermochemistry data

Data compiled by: Hussein Y. Afeefy, Joel F. Liebman, and Stephen E. Stein
Quantity | Value | Units | Method | Reference | Comment |
---|---|---|---|---|---|
ΔcH°liquid | -7432.9 | kJ/mol | Ccb | Shtekher, Skuratov, et al., 1959 | Corresponding ΔfHºliquid = -326. kJ/mol (simple calculation by NIST; no Washburn corrections) |
ΔcH°liquid | -7433.7 | kJ/mol | Ccb | Skuratov, Kozina, et al., 1958 | Corresponding ΔfHºliquid = -325. kJ/mol (simple calculation by NIST; no Washburn corrections) |

References

Shtekher, Skuratov, et al., 1959
Shtekher, S.M.; Skuratov, S.M.; Daukshas, V.K.; Levina, R.Ya.,
Heats of combustion of some branched alkanes,
Dokl. Akad. Nauk SSSR, 1959, 127, 812-814. [all data]
Skuratov, Kozina, et al., 1958
Skuratov, S.M.; Kozina, M.P.; Shtocher, S.M.; Prevalova, N.M.; Kamkina, L.S.; Zuko, V.D.,
Heats of combustion of cyclic compounds,
Bull. Chem. Thermodyn., 1958, 1, 21. [all data]