Piperidine, 1-acetyl-
- Formula: C7H13NO
- Molecular weight: 127.1842
- IUPAC Standard InChIKey: KDISMIMTGUMORD-UHFFFAOYSA-N
- CAS Registry Number: 618-42-8
- Chemical structure:
View 3d structure (requires JavaScript / HTML 5) - Other names: Acetic acid, piperidide; Ethanone, 1-(1-piperidinyl)-; N-Acetylpiperidine; 1-Acetylpiperidine; N-Acetylpiperidin; Acetyl piperidide; acetyl piperidine; methyl 1-piperidyl ketone

Gas phase ion energetics data

Data compiled by: Sharon G. Lias, Rhoda D. Levin, and Sherif A. Kafafi
Ionization energy determinations
IE (eV) | Method | Reference |
---|---|---|
9.1 | EI | Schwarz and Bohlmann, 1973 |
Appearance energy determinations
Ion | AE (eV) | Other Products | Method | Reference | Comment |
---|---|---|---|---|---|
C2H3O+ | 15.1 | ? | EI | Schwarz and Bohlmann, 1973 |

Kovats' RI, non-polar column, isothermal

Column type | Active phase | Temperature (C) | I | Reference | Comment |
---|---|---|---|---|---|
Packed | Apiezon L | 150. | 1214. | Zhuravleva I.L., Golovnya R.V., et al., 1978 | N2, Chromosorb G-AW; Column length: 2.7 m |

Van Den Dool and Kratz RI, non-polar column, temperature ramp

Column type | Active phase | I | Reference | Comment |
---|---|---|---|---|
Capillary | DB-5 | 1205. | Moio L., Rillo L., et al., 1996 | 30. m/0.32 mm/1. μm, H2, 3. K/min; Tstart: 40. C; Tend: 220. C |

Normal alkane RI, non-polar column, temperature ramp

Column type | Active phase | I | Reference | Comment |
---|---|---|---|---|
Capillary | DB-5 | 1205. | Moio, Dekimpe, et al., 1993 | 30. m/0.32 mm/1. μm, H2, 3. K/min; Tstart: 40. C; Tend: 220. C |
Capillary | SE-54 | 1193. | Kollmannsberger, Nitz, et al., 1992 | 30. m/0.25 mm/0.25 μm, Hydrogen, 60. C @ 5. min, 2. K/min, 250. C @ 2. min |

Phase change data

Data compiled by: Robert L. Brown and Stephen E. Stein
Quantity | Value | Units | Method | Reference | Comment |
---|---|---|---|---|---|
Tboil | 499.2 | K | N/A | Aldrich Chemical Company Inc., 1990 |

References

Schwarz and Bohlmann, 1973
Schwarz, H.; Bohlmann, F.,
Massenspektrometrische untersuchung von amiden. I. Energetische betrachtungen zur elektronenstrossin-duzierten fragmentierung von piperidin- und piperidein- amiden,
Org. Mass Spectrom., 1973, 7, 1197. [all data]