Stibine, triethyl-
- Formula: C6H15Sb
- Molecular weight: 208.943
- IUPAC Standard InChIKey: KKOFCVMVBJXDFP-UHFFFAOYSA-N
- CAS Registry Number: 617-85-6
- Chemical structure:

Phase change data

Data compiled as indicated in comments:
TRC - Thermodynamics Research Center, NIST Boulder Laboratories, Chris Muzny director
AC - William E. Acree, Jr., James S. Chickos
MS - José A. Martinho Simões
DH - Eugene S. Domalski and Elizabeth D. Hearing
Quantity | Value | Units | Method | Reference | Comment |
---|---|---|---|---|---|
Ttriple | 153.9 | K | N/A | Maslova, Novoselova, et al., 1973 | Uncertainty assigned by TRC = 0.2 K; TRC |
Quantity | Value | Units | Method | Reference | Comment |
ΔvapH° | 45.6 | kJ/mol | N/A | Fulem, Ruzicka, et al., 2006 | Based on data from 238. to 309. K.; AC |
ΔvapH° | 43.5 ± 4.2 | kJ/mol | CC-SB | Bamford, Levi, et al., 1946 | MS |
Enthalpy of vaporization
ΔvapH (kJ/mol) | Temperature (K) | Method | Reference | Comment |
---|---|---|---|---|
47.6 | 260. | N/A | Fulem, Ruzicka, et al., 2006 | Based on data from 238. to 309. K.; AC |
44.2 | 320. | N/A | Fulem, Ruzicka, et al., 2006 | Based on data from 238. to 309. K.; AC |
41.4 | 360. | N/A | Fulem, Ruzicka, et al., 2006 | Based on data from 238. to 309. K. See also Bamford, Levi, et al., 1946, 2.; AC |
38.3 | 400. | N/A | Fulem, Ruzicka, et al., 2006 | Based on data from 238. to 309. K. See also Bamford, Levi, et al., 1946, 2.; AC |
39.9 ± 1.3 | 306. | N/A | Baev, 2001 | Based on data from 193. to 333. K.; AC |
41.8 | 273. to 393. | BG | Bamford, Levi, et al., 1946, 2 | AC |
Enthalpy of fusion
ΔfusH (kJ/mol) | Temperature (K) | Reference | Comment |
---|---|---|---|
9.452 | 153.9 | Maslova, Novoselova, et al., 1973, 2 | DH |
9.45 | 153.9 | Domalski and Hearing, 1996 | AC |
Entropy of fusion
ΔfusS (J/mol*K) | Temperature (K) | Reference | Comment |
---|---|---|---|
61.42 | 153.9 | Maslova, Novoselova, et al., 1973, 2 | DH |

Gas phase ion energetics data

Data compiled as indicated in comments:
RDSH - Henry M. Rosenstock, Keith Draxl, Bruce W. Steiner, and John T. Herron
Ionization energy determinations
IE (eV) | Method | Reference | Comment |
---|---|---|---|
13.0 ± 0.3 | EI | Bogolyubov, Grishin, et al., 1969 | RDSH |
9.2 ± 0.3 | EI | Bogolyubov, Grishin, et al., 1969 | RDSH |
Appearance energy determinations
Ion | AE (eV) | Other Products | Method | Reference | Comment |
---|---|---|---|---|---|
CH3Sb+ | 16.5 ± 0.3 | ? | EI | Bogolyubov, Grishin, et al., 1969 | RDSH |
CH4Sb+ | 17.4 ± 0.3 | ? | EI | Bogolyubov, Grishin, et al., 1969 | RDSH |
C2H4Sb+ | 14.8 ± 0.3 | ? | EI | Bogolyubov, Grishin, et al., 1969 | RDSH |
C2H5Sb+ | 12.4 ± 0.3 | ? | EI | Bogolyubov, Grishin, et al., 1969 | RDSH |
C2H6Sb+ | 12.6 ± 0.3 | ? | EI | Bogolyubov, Grishin, et al., 1969 | RDSH |
C2H7Sb+ | 12.6 ± 0.3 | ? | EI | Bogolyubov, Grishin, et al., 1969 | RDSH |
C4H10Sb+ | 10.7 ± 0.3 | ? | EI | Bogolyubov, Grishin, et al., 1969 | RDSH |
C4H11Sb+ | 10.0 ± 0.3 | ? | EI | Bogolyubov, Grishin, et al., 1969 | RDSH |
SbH+ | 18.3 ± 0.3 | ? | EI | Bogolyubov, Grishin, et al., 1969 | RDSH |
SbH2+ | 17.2 ± 0.3 | ? | EI | Bogolyubov, Grishin, et al., 1969 | RDSH |
Sb+ | 19.2 ± 0.3 | ? | EI | Bogolyubov, Grishin, et al., 1969 | RDSH |

Gas phase thermochemistry data

Data compiled by: José A. Martinho Simões
Quantity | Value | Units | Method | Reference | Comment |
---|---|---|---|---|---|
ΔfH°gas | 49. ± 12. | kJ/mol | Review | Martinho Simões |

Condensed phase thermochemistry data

Data compiled as indicated in comments:
MS - José A. Martinho Simões
DH - Eugene S. Domalski and Elizabeth D. Hearing
Quantity | Value | Units | Method | Reference | Comment |
---|---|---|---|---|---|
ΔfH°liquid | 5. ± 11. | kJ/mol | Review | Martinho Simões | MS |
Quantity | Value | Units | Method | Reference | Comment |
ΔcH°liquid | -4864. ± 11. | kJ/mol | CC-SB | Lautsch, Tröber, et al., 1963 | Please also see Pedley and Rylance, 1977 and Cox and Pilcher, 1970.; MS |
Constant pressure heat capacity of liquid
Cp,liquid (J/mol*K) | Temperature (K) | Reference | Comment |
---|---|---|---|
242.25 | 298.15 | Maslova, Novoselova, et al., 1973 | T = 60 to 300 K.; DH |

References

Maslova, Novoselova, et al., 1973
Maslova, V.A.; Novoselova, N.V.; Moseeva, E.M.; Berezhnaya, N.D.; Rabinovich, I.B.,
Specific Heat and Phase Changes of Triethylindium, Triethylantimony, and Trimethylgallium,
Tr. Khim. Khim. Tekhnol., 1973, 1973, 51. [all data]
Fulem, Ruzicka, et al., 2006
Fulem, M.; Ruzicka, K.; Ruzicka, V.; Simecek, T.; Hulicius, E.; Pangrác, J.,
Vapour pressure measurement of metal organic precursors used for MOVPE,
The Journal of Chemical Thermodynamics, 2006, 38, 3, 312-322, https://doi.org/10.1016/j.jct.2005.05.018
. [all data]
Bamford, Levi, et al., 1946
Bamford, C.H.; Levi, D.L.; Newitt, D.M.,
J. Chem. Soc., 1946, 468.. [all data]
Bamford, Levi, et al., 1946, 2
Bamford, C.H.; Levi, D.L.; Newitt, D.M.,
91. Physical and chemical properties of organo-metallic compounds. Part I. The vapour pressures and freezing points of simple metal alkyls of Groups II, III, and V,
J. Chem. Soc., 1946, 468, https://doi.org/10.1039/jr9460000468
. [all data]
Baev, 2001
Baev, A.K.,
Izv. Vyssh. Uchebn. Zaved., Khim. Khim. Tekhnol., 2001, 44, 1, 3. [all data]
Maslova, Novoselova, et al., 1973, 2
Maslova, V.A.; Novoselova, N.V.; Moseeva, E.M.; Berezhnaya, N.D.; Rabinovich, I.B.,
Specific heat and phase changes of triethylindium, triethyl antimony, and trimethyl gallium,
Trudy. Khim. Khim. Tekhnol., 1973, (2), 51-52. [all data]
Domalski and Hearing, 1996
Domalski, Eugene S.; Hearing, Elizabeth D.,
Heat Capacities and Entropies of Organic Compounds in the Condensed Phase. Volume III,
J. Phys. Chem. Ref. Data, 1996, 25, 1, 1, https://doi.org/10.1063/1.555985
. [all data]
Bogolyubov, Grishin, et al., 1969
Bogolyubov, G.M.; Grishin, N.N.; Petrov, A.A.,
Organic derivatives of group V and group VI elements. X. Mass spectra of tetraethyldistibine, diethyl diselenide, diethyl ditelluride, and the corresponding monoderivatives. Interpretation of mass-spectral intensities,
Zh. Obshch. Khim., 1969, 39, 2244, In original 2190. [all data]