Formamide, N,N-diethyl-
- Formula: C5H11NO
- Molecular weight: 101.1469
- IUPAC Standard InChIKey: SUAKHGWARZSWIH-UHFFFAOYSA-N
- CAS Registry Number: 617-84-5
- Chemical structure:
View 3d structure (requires JavaScript / HTML 5) - Other names: Diethylformamide; N-Formyldiethylamine; N,N-Diethylformamide; Diethylamid kyseliny mravenci

Phase change data

Data compiled as indicated in comments:
BS - Robert L. Brown and Stephen E. Stein
AC - William E. Acree, Jr., James S. Chickos
Quantity | Value | Units | Method | Reference | Comment |
---|---|---|---|---|---|
Tboil | 450.7 | K | N/A | Weast and Grasselli, 1989 | BS |
Quantity | Value | Units | Method | Reference | Comment |
ΔvapH° | 50.3 | kJ/mol | N/A | Barone, Castronuovo, et al., 1985 | See also Majer and Svoboda, 1985.; AC |
Reduced pressure boiling point
Tboil (K) | Pressure (bar) | Reference | Comment |
---|---|---|---|
341.2 | 0.020 | Weast and Grasselli, 1989 | BS |
Enthalpy of vaporization
ΔvapH (kJ/mol) | Temperature (K) | Method | Reference | Comment |
---|---|---|---|---|
48.9 | 318. | A | Stephenson and Malanowski, 1987 | Based on data from 303. to 363. K. See also Gopal and Rizvi, 1968.; AC |
Antoine Equation Parameters
log10(P) = A − (B / (T + C))
P = vapor pressure (bar)
T = temperature (K)
View plot Requires a JavaScript / HTML 5 canvas capable browser.
Temperature (K) | A | B | C | Reference | Comment |
---|---|---|---|---|---|
303. to 363. | 5.06358 | 2046.363 | -35.774 | Gopal and Rizvi, 1968, 2 | Coefficents calculated by NIST from author's data. |

Gas phase ion energetics data

Data compiled by: Henry M. Rosenstock, Keith Draxl, Bruce W. Steiner, and John T. Herron
Ionization energy determinations
IE (eV) | Method | Reference |
---|---|---|
8.89 ± 0.02 | PI | Watanabe, Nakayama, et al., 1962 |

Normal alkane RI, non-polar column, temperature ramp

Column type | Active phase | I | Reference | Comment |
---|---|---|---|---|
Capillary | DB-5 | 912. | Savel'eva, Zenkevich, et al., 2003 | 25. m/0.20 mm/0.33 μm, Helium, 40. C @ 1. min, 5. K/min, 270. C @ 15. min |
Capillary | DB-5 | 930. | Savel'eva, Zenkevich, et al., 2002 | 25. m/0.20 mm/0.33 μm, Helium, 40. C @ 1. min, 5. K/min, 270. C @ 15. min |

Normal alkane RI, non-polar column, custom temperature program

Column type | Active phase | I | Reference | Comment |
---|---|---|---|---|
Capillary | Methyl Silicone | 895. | Savelieva and Zenkevich I., 2003 | Program: not specified |
Capillary | Methyl Silicone | 930. | Savelieva and Zenkevich I., 2003 | Program: not specified |

Normal alkane RI, polar column, custom temperature program

Column type | Active phase | I | Reference | Comment |
---|---|---|---|---|
Capillary | DB-Wax | 1413. | Peng, Yang, et al., 1991 | Program: not specified |

References

Weast and Grasselli, 1989
CRC Handbook of Data on Organic Compounds, 2nd Editon, Weast,R.C and Grasselli, J.G., ed(s)., CRC Press, Inc., Boca Raton, FL, 1989, 1. [all data]
Barone, Castronuovo, et al., 1985
Barone, G.; Castronuovo, G.; Della Gatta, G.; Elia, V.; Iannone, A.,
Enthalpies of vaporization of seven alkylamides,
Fluid Phase Equilibria, 1985, 21, 1-2, 157-164, https://doi.org/10.1016/0378-3812(85)90066-4
. [all data]
Majer and Svoboda, 1985
Majer, V.; Svoboda, V.,
Enthalpies of Vaporization of Organic Compounds: A Critical Review and Data Compilation, Blackwell Scientific Publications, Oxford, 1985, 300. [all data]
Stephenson and Malanowski, 1987
Stephenson, Richard M.; Malanowski, Stanislaw,
Handbook of the Thermodynamics of Organic Compounds, 1987, https://doi.org/10.1007/978-94-009-3173-2
. [all data]
Gopal and Rizvi, 1968
Gopal, R.; Rizvi, S.A.,
J. Indian Chem. Soc., 1968, 45, 1, 13. [all data]
Gopal and Rizvi, 1968, 2
Gopal, R.; Rizvi, S.A.,
Vapour Pressures of Some Mono- and Di-Alkyl Substituted Aliphatic Amides at Different Temperatures,
J. Indian Chem. Soc., 1968, 45, 1, 13-16. [all data]
Watanabe, Nakayama, et al., 1962
Watanabe, K.; Nakayama, T.; Mottl, J.,
Ionization potentials of some molecules,
J. Quant. Spectry. Radiative Transfer, 1962, 2, 369. [all data]
Savel'eva, Zenkevich, et al., 2003
Savel'eva, E.I.; Zenkevich, I.G.; Radilov, A.S.,
Identification the Products of Chemical Neutralization of O-Isobutyl-S-(2-diethylaminoethyl)methylthiophosphonate in the Composition of Bitumen-Salt Matrices,
Zh. Anal. Khim. (Rus.), 2003, 58, 2, 135-145. [all data]
Savel'eva, Zenkevich, et al., 2002
Savel'eva, E.I.; Zenkevich, I.G.; Kuznetsova, T.A.; Radilov, A.S.; Pshenichnaya, G.V.,
Investigation of Products of Transformation of Phosphororganic Toxic Substances with Gas Chromatography - Mass Spectrometry,
Rus. Khim. Zh. (Rus.), 2002, 56, 6, 82-91. [all data]
Savelieva and Zenkevich I., 2003
Savelieva, E.; Zenkevich I.,
Analisi GC/MS di agenti chimici nervini,
Laboratorio 2000, 2003, 17, 6/7, 24-26. [all data]
Peng, Yang, et al., 1991
Peng, C.T.; Yang, Z.C.; Ding, S.F.,
Prediction of rentention idexes. II. Structure-retention index relationship on polar columns,
J. Chromatogr., 1991, 586, 1, 85-112, https://doi.org/10.1016/0021-9673(91)80028-F
. [all data]