Diethylcyanamide
- Formula: C5H10N2
- Molecular weight: 98.1463
- IUPAC Standard InChIKey: ZZTSQZQUWBFTAT-UHFFFAOYSA-N
- CAS Registry Number: 617-83-4
- Chemical structure:
View 3d structure (requires JavaScript / HTML 5) - Other names: Cyanamide, diethyl-; N,N-Diethylcyanamide; USAF ek-6326; Diethylkyanamid

Gas phase thermochemistry data

Data compiled as indicated in comments:
ALS - Hussein Y. Afeefy, Joel F. Liebman, and Stephen E. Stein
DRB - Donald R. Burgess, Jr.
Quantity | Value | Units | Method | Reference | Comment |
---|---|---|---|---|---|
ΔfH°gas | 63.5 ± 3.1 | kJ/mol | Ccb | Ushakov, Sedov, et al., 1997 | ALS |
ΔfH°gas | 63.5 ± 2.1 | kJ/mol | Ccb | Ushakov, Sedov, et al., 1997 | ALS |
ΔfH°gas | 63.5 | kJ/mol | N/A | Ushakov, Sedov, et al., 1997 | Value computed using ΔfHliquid° value of 15.8±1.8 kj/mol from Ushakov, Sedov, et al., 1997 and ΔvapH° value of 47.7 kj/mol from Ushakov, Sedov, et al., 1997.; DRB |

Condensed phase thermochemistry data

Data compiled by: Hussein Y. Afeefy, Joel F. Liebman, and Stephen E. Stein
Quantity | Value | Units | Method | Reference | Comment |
---|---|---|---|---|---|
ΔfH°liquid | 15.8 ± 1.8 | kJ/mol | Ccb | Ushakov, Sedov, et al., 1997 | |
ΔfH°liquid | 15.8 ± 1.8 | kJ/mol | Ccb | Ushakov, Sedov, et al., 1997 | |
Quantity | Value | Units | Method | Reference | Comment |
ΔcH°liquid | -3412.5 ± 1.8 | kJ/mol | Ccb | Ushakov, Sedov, et al., 1997 | |
ΔcH°liquid | -3412.5 ± 1.8 | kJ/mol | Ccb | Ushakov, Sedov, et al., 1997 |

Phase change data

Data compiled as indicated in comments:
BS - Robert L. Brown and Stephen E. Stein
TRC - Thermodynamics Research Center, NIST Boulder Laboratories, Chris Muzny director
ALS - Hussein Y. Afeefy, Joel F. Liebman, and Stephen E. Stein
DRB - Donald R. Burgess, Jr.
Quantity | Value | Units | Method | Reference | Comment |
---|---|---|---|---|---|
Tboil | 461.2 | K | N/A | Weast and Grasselli, 1989 | BS |
Quantity | Value | Units | Method | Reference | Comment |
Tfus | 192.1 | K | N/A | Witschonke, 1954 | Uncertainty assigned by TRC = 0.35 K; TRC |
Tfus | 192.55 | K | N/A | Witschonke, 1954 | Uncertainty assigned by TRC = 0.2 K; TRC |
Quantity | Value | Units | Method | Reference | Comment |
ΔvapH° | 47.7 ± 0.8 | kJ/mol | V | Ushakov, Sedov, et al., 1997 | ALS |
ΔvapH° | 47.7 ± 0.8 | kJ/mol | V | Ushakov, Sedov, et al., 1997 | ALS |
ΔvapH° | 47.7 | kJ/mol | N/A | Ushakov, Sedov, et al., 1997 | DRB |

Gas phase ion energetics data

Data compiled by: Sharon G. Lias, John E. Bartmess, Joel F. Liebman, John L. Holmes, Rhoda D. Levin, and W. Gary Mallard
Ionization energy determinations
IE (eV) | Method | Reference |
---|---|---|
8.97 | PE | Molder, Pikver, et al., 1983 |

Normal alkane RI, non-polar column, temperature ramp

Column type | Active phase | I | Reference | Comment |
---|---|---|---|---|
Capillary | VF-5 | 903. | Li and Zhao, 2009 | 30. m/0.25 mm/0.25 μm, Helium, 60. C @ 2. min, 10. K/min, 300. C @ 10. min |

References

Ushakov, Sedov, et al., 1997
Ushakov, V.S.; Sedov, S.M.; Knyazev, B.A.; Kuchkaev, B.I.,
The thermodynamic properties of N,N-diethyl cyanamide,
Russ. J. Phys. Chem. (Engl. Transl.), 1997, 72, 1565-1568, In original 1743. [all data]
Weast and Grasselli, 1989
CRC Handbook of Data on Organic Compounds, 2nd Editon, Weast,R.C and Grasselli, J.G., ed(s)., CRC Press, Inc., Boca Raton, FL, 1989, 1. [all data]
Witschonke, 1954
Witschonke, C.R.,
Freezing point and purity data for some organic compounds,
Anal. Chem., 1954, 26, 562-4. [all data]
Molder, Pikver, et al., 1983
Molder, U.H.; Pikver, R.J.; Koppel, I.A.,
Photoelectron spectra of molecules. 3. Nitriles,
Org. React. Tartu, 1983, 20, 230. [all data]
Li and Zhao, 2009
Li, L.; Zhao, J.,
Determination of the volatile composition of Rhodobryum giganteum (Schwaegr.) Par. (Bryaceae) using solid-phase microextraction and gas chromatography / mass spectrometry (GC/MS),
Molecules, 2009, 14, 6, 2195-2201, https://doi.org/10.3390/molecules14062195
. [all data]