2-Dodecanone
- Formula: C12H24O
- Molecular weight: 184.3184
- IUPAC Standard InChIKey: LSKONYYRONEBKA-UHFFFAOYSA-N
- CAS Registry Number: 6175-49-1
- Chemical structure:
View 3d structure (requires JavaScript / HTML 5) - Other names: Decyl methyl ketone; Dodecan-2-one; Methyl decyl ketone; Dodecanone-(2)

Phase change data

Data compiled as indicated in comments:
TRC - Thermodynamics Research Center, NIST Boulder Laboratories, Chris Muzny director
ALS - Hussein Y. Afeefy, Joel F. Liebman, and Stephen E. Stein
AC - William E. Acree, Jr., James S. Chickos
Quantity | Value | Units | Method | Reference | Comment |
---|---|---|---|---|---|
Tboil | 519.65 | K | N/A | Clement and Selwitz, 1964 | Uncertainty assigned by TRC = 2. K; TRC |
Tboil | 518.15 | K | N/A | Birch and Robinson, 1942 | Uncertainty assigned by TRC = 2. K; TRC |
Tboil | 519.65 | K | N/A | Krafft, 1882 | Uncertainty assigned by TRC = 2. K; TRC |
Quantity | Value | Units | Method | Reference | Comment |
Tc | 702.1 | K | N/A | Pulliam, Gude, et al., 1995 | Uncertainty assigned by TRC = 2.7 K; TRC |
Quantity | Value | Units | Method | Reference | Comment |
ρc | 1.33 | mol/l | N/A | Pulliam, Gude, et al., 1995 | Uncertainty assigned by TRC = 0.04 mol/l; TRC |
Quantity | Value | Units | Method | Reference | Comment |
ΔvapH° | 71.83 | kJ/mol | N/A | Majer and Svoboda, 1985 | |
ΔvapH° | 71.83 ± 0.64 | kJ/mol | C | Sellers, 1977 | ALS |
ΔvapH° | 71.8 ± 0.6 | kJ/mol | C | Sellers, 1977 | AC |
Enthalpy of vaporization
ΔvapH (kJ/mol) | Temperature (K) | Method | Reference | Comment |
---|---|---|---|---|
61.1 | 365. | A | Stephenson and Malanowski, 1987 | Based on data from 350. to 520. K. See also Stull, 1947.; AC |
60.8 | 401. | A | Stephenson and Malanowski, 1987 | Based on data from 386. to 609. K. See also Ambrose, Ellender, et al., 1975.; AC |
48.1 | 524. | N/A | Ambrose, Ellender, et al., 1975 | Based on data from 386. to 609. K.; AC |

Gas phase thermochemistry data

Data compiled by: Hussein Y. Afeefy, Joel F. Liebman, and Stephen E. Stein
Quantity | Value | Units | Method | Reference | Comment |
---|---|---|---|---|---|
ΔfH°gas | -404.3 ± 2.5 | kJ/mol | Ccr | Sellers, 1977 |

Condensed phase thermochemistry data

Data compiled by: Hussein Y. Afeefy, Joel F. Liebman, and Stephen E. Stein
Quantity | Value | Units | Method | Reference | Comment |
---|---|---|---|---|---|
ΔfH°liquid | -476.1 ± 2.4 | kJ/mol | Ccr | Sellers, 1977 | |
Quantity | Value | Units | Method | Reference | Comment |
ΔcH°liquid | -7676.0 ± 1.7 | kJ/mol | Ccr | Sellers, 1977 | Corresponding ΔfHºliquid = -476.13 kJ/mol (simple calculation by NIST; no Washburn corrections) |

Normal alkane RI, non-polar column, custom temperature program

Data compiled by: NIST Mass Spectrometry Data Center, William E. Wallace, director

Column type CapillaryCapillaryCapillaryCapillaryCapillary
Active phase TR-5 MSSiloxane, 5 % PhHP-5 MSPolydimethyl siloxane, 5 % phenylBPX-5
Column length (m) 15. 30. 30.
Carrier gas Helium Helium Helium
Substrate
Column diameter (mm) 0.25 0.25 0.25
Phase thickness (μm) 0.25 0.25 0.25
Program 35 0C (3 min) 2 0C/min -> 60 0C (3 min) 2 0C/min -> 80 0C (3 min) 4 0C/min -> 120 0C (3 min) 5 0C/min -> 150 0C (3 min) 15 0C/min -> 240 0C (10 min)not specified40 0C (10 min) 3 0C/min -> 200 0C 2 0C/min -> 220 0Cnot specified35 0C (5 min) 3 0C/min -> 210 0C 40 0C/min -> 240 0C (10 min)
I 1395.1404.1397.1404.1410.
ReferenceKurashov, Mitrukova, et al., 2014VOC BinBase, 2012Nance and Setzer, 2011Skogerson, Wohlgemuth, et al., 2011se Souza, Cardeal, et al., 2009
Comment MSDC-RI MSDC-RI MSDC-RI MSDC-RI MSDC-RI
Column type CapillaryCapillaryCapillaryCapillary
Active phase BPX-5SE-30Polydimethyl siloxaneCP Sil 5 CB
Column length (m) 30.  25.
Carrier gas Helium  N2
Substrate
Column diameter (mm) 0.25
Phase thickness (μm) 0.25  0.39
Program not specifiednot specifiednot specifiednot specified
I 1410.1377.1370.1375.
Referencese Souza, Cardeal, et al., 2009Vinogradov, 2004Junkes, Castanho, et al., 2003Weyerstahl, Marschall, et al., 1998
Comment MSDC-RI MSDC-RI MSDC-RI MSDC-RI

Normal alkane RI, polar column, temperature ramp

Data compiled by: NIST Mass Spectrometry Data Center, William E. Wallace, director

Column type CapillaryCapillaryCapillaryCapillaryCapillary
Active phase HP-WaxDB-WaxDB-WaxCarbowax 20MCarbowax 20M
Column length (m) 30.30.30.50.80.
Carrier gas N2  He
Substrate
Column diameter (mm) 0.250.530.530.250.2
Phase thickness (μm) 0.25
Tstart (C) 50.60.60.60.70.
Tend (C) 250.210.210.180.170.
Heat rate (K/min) 5.4.4.2.2.
Initial hold (min)    4.
Final hold (min) 10.
I 1692.1708.1709.1674.1688.
ReferenceFredj, Marzouk, et al., 2007Iwatsuki, Mizota, et al., 1999Iwatsuki, Mizota, et al., 1999Kawakami and Kobayashi, 1991Anker, Jurs, et al., 1990
Comment MSDC-RI MSDC-RI MSDC-RI MSDC-RI MSDC-RI
Column type Capillary
Active phase SP-1000
Column length (m) 25.
Carrier gas N2
Substrate
Column diameter (mm) 0.2
Phase thickness (μm) 0.43
Tstart (C) 60.
Tend (C) 190.
Heat rate (K/min) 4.
Initial hold (min)
Final hold (min) 30.
I 1698.
ReferenceDe Llano D.G., Ramos M., et al., 1990
Comment MSDC-RI

Kovats' RI, non-polar column, isothermal

Data compiled by: NIST Mass Spectrometry Data Center, William E. Wallace, director

Column type PackedCapillaryCapillaryPackedCapillary
Active phase OV-101SE-30ApolaneApolaneOV-101
Column length (m) 2.27.43.2.20.
Carrier gas N2N2N2N2
Substrate Chromosorb G HPChromosorb G HP Chromosorb G HP
Column diameter (mm)  0.40.290.290.5
Phase thickness (μm)  1.130.280.28
Temperature (C) 220.220.220.220.180.
I 1394.31383.81382.11366.51392.9
ReferenceDidaoui, Touabet, et al., 1997Didaoui, Touabet, et al., 1997Didaoui, Touabet, et al., 1997Didaoui, Touabet, et al., 1997Cha and Lee, 1994
Comment MSDC-RI MSDC-RI MSDC-RI MSDC-RI MSDC-RI

Van Den Dool and Kratz RI, non-polar column, custom temperature program

Data compiled by: NIST Mass Spectrometry Data Center, William E. Wallace, director

Column type Capillary
Active phase DB-1
Column length (m) 60.
Carrier gas He
Substrate
Column diameter (mm) 0.25
Phase thickness (μm) 0.25
Program -20C (5min) => 10C/min => 100C => 4C/min => 200C => 10C/min => 280C
I 1377.
ReferenceEri, Khoo, et al., 2000
Comment MSDC-RI

References

Clement and Selwitz, 1964
Clement, W.H.; Selwitz, C.M.,
Improved procedures for converting higher alpha-olefins to methyl ketones with palladium chloride,
J. Org. Chem., 1964, 29, 241. [all data]
Birch and Robinson, 1942
Birch, A.J.; Robinson, R.,
Long-chain acids containing a quaternary carbon atom: I,
J. Chem. Soc., 1942, 1942, 488. [all data]
Krafft, 1882
Krafft, F.,
On Nineteen Higher Normal Paraffins and a Simple Volume Law for Liquids that form Drops I.,
Ber. Dtsch. Chem. Ges., 1882, 15, 1687-711. [all data]
Pulliam, Gude, et al., 1995
Pulliam, M.K.; Gude, M.T.; Teja, A.S.,
Critical Temperatures and Densities of n-Alkanones,
J. Chem. Eng. Data, 1995, 40, 455-8. [all data]
Majer and Svoboda, 1985
Majer, V.; Svoboda, V.,
Enthalpies of Vaporization of Organic Compounds: A Critical Review and Data Compilation, Blackwell Scientific Publications, Oxford, 1985, 300. [all data]
Sellers, 1977
Sellers, P.,
Enthalpies of combustion and formation of 2-nonanone and 2-dodecanone,
J. Chem. Thermodyn., 1977, 9, 139-142. [all data]
Stephenson and Malanowski, 1987
Stephenson, Richard M.; Malanowski, Stanislaw,
Handbook of the Thermodynamics of Organic Compounds, 1987, https://doi.org/10.1007/978-94-009-3173-2
. [all data]
Stull, 1947
Stull, Daniel R.,
Vapor Pressure of Pure Substances. Organic and Inorganic Compounds,
Ind. Eng. Chem., 1947, 39, 4, 517-540, https://doi.org/10.1021/ie50448a022
. [all data]
Ambrose, Ellender, et al., 1975
Ambrose, D.; Ellender, J.H.; Lees, E.B.; Sprake, C.H.S.; Townsend, R.,
Thermodynamic properties of organic oxygen compounds XXXVIII. Vapour pressures of some aliphatic ketones,
The Journal of Chemical Thermodynamics, 1975, 7, 5, 453-472, https://doi.org/10.1016/0021-9614(75)90275-X
. [all data]