Ethyl oxamate
- Formula: C4H7NO3
- Molecular weight: 117.1033
- IUPAC Standard InChIKey: RZMZBHSKPLVQCP-UHFFFAOYSA-N
- CAS Registry Number: 617-36-7
- Chemical structure:
View 3d structure (requires JavaScript / HTML 5) - Other names: Oxamic acid ethyl ester; Acetic acid, aminooxo-, ethyl ester; Ethoxalamide; Oxalic acid, monoethyl ester amide

Reaction thermochemistry data

Data compiled by: John E. Bartmess
Individual Reactions
C4H6NO3- + =
By formula: C4H6NO3- + H+ = C4H7NO3
Quantity | Value | Units | Method | Reference | Comment |
---|---|---|---|---|---|
ΔrH° | 1471. ± 8.8 | kJ/mol | G+TS | Taft, 1987 | gas phase; value altered from reference due to change in acidity scale |
Quantity | Value | Units | Method | Reference | Comment |
ΔrG° | 1442. ± 8.4 | kJ/mol | IMRE | Taft, 1987 | gas phase; value altered from reference due to change in acidity scale |

Gas phase ion energetics data

Data compiled as indicated in comments:
B - John E. Bartmess
LLK - Sharon G. Lias, Rhoda D. Levin, and Sherif A. Kafafi
Ionization energy determinations
IE (eV) | Method | Reference | Comment |
---|---|---|---|
9.85 | PE | Meeks and McGlynn, 1975 | Vertical value; LLK |
De-protonation reactions
C4H6NO3- + =
By formula: C4H6NO3- + H+ = C4H7NO3
Quantity | Value | Units | Method | Reference | Comment |
---|---|---|---|---|---|
ΔrH° | 1471. ± 8.8 | kJ/mol | G+TS | Taft, 1987 | gas phase; value altered from reference due to change in acidity scale; B |
Quantity | Value | Units | Method | Reference | Comment |
ΔrG° | 1442. ± 8.4 | kJ/mol | IMRE | Taft, 1987 | gas phase; value altered from reference due to change in acidity scale; B |

References

Taft, 1987
Taft, R.W.,
The Nature and Analysis of Substitutent Electronic Effects,
Personal communication. See also Prog. Phys. Org. Chem., 1987, 16, 1. [all data]
Meeks and McGlynn, 1975
Meeks, J.L.; McGlynn, S.P.,
Photoelectron spectra of carbonyls. Oxalyl chloride, ethyl oxalyl chloride, ethyl oxamate and N,N-dimethyl ethyl oxamate,
Spectrosc. Lett., 1975, 8, 439. [all data]