L-Cysteine, N-acetyl-
- Formula: C5H9NO3S
- Molecular weight: 163.195
- IUPAC Standard InChIKey: PWKSKIMOESPYIA-SCSAIBSYSA-N
- CAS Registry Number: 616-91-1
- Chemical structure:
View 3d structure (requires JavaScript / HTML 5) - Other names: Cysteine, N-acetyl-, L-; Airbron; Fluimucetin; Fluimucil; Mercapturic acid; Mercapturic acid, (R)-; Mucolyticum Lappe; Mucomyst; N-Acetyl-L-cysteine; N-Acetylcysteine; Respaire; Acetein; Broncholysin; Flumucetin; L-Acetylcysteine; Mucolytikum Lappe; Mucosolvin; NAC; NAC-TB; Parvolex; L-α-Acetamido-β-mercaptopropionic acid; Inspir; Mucolyticum; NSC 111180; Brunac; Fabrol; Fluatox; Fluprowit; Muco sanigen; Mucocedyl; Mucolator; Mucret; Neo-fluimucil; Tixair; Fluimicil Infantil; Lysomucil; Mucofilin; Acetylcysteine

Reaction thermochemistry data

Data compiled by: Robert C. Dunbar
Individual Reactions
By formula: Na+ + C5H9NO3S = (Na+ • C5H9NO3S)
Free energy of reaction
ΔrG° (kJ/mol) | T (K) | Method | Reference |
---|---|---|---|
129. | 0. | CIDC | Feng, Gronert, et al., 1999 |

Ion clustering data

Data compiled by: Robert C. Dunbar
Clustering reactions
By formula: Na+ + C5H9NO3S = (Na+ • C5H9NO3S)
Free energy of reaction
ΔrG° (kJ/mol) | T (K) | Method | Reference |
---|---|---|---|
129. | 0. | CIDC | Feng, Gronert, et al., 1999 |

Normal alkane RI, non-polar column, custom temperature program

Column type | Active phase | I | Reference | Comment |
---|---|---|---|---|
Capillary | Polydimethyl siloxanes | 1547. | Schutz and Wollrab A., 1988 | Program: not specified |
Other | Methyl Silicone | 1547. | Ardrey and Moffat, 1981 | Program: not specified |

References

Feng, Gronert, et al., 1999
Feng, W.Y.; Gronert, S.; Lebrilla, C.B.,
Lithium and sodium ion binding energies of N-acetyl and N-glycyl amino acids,
J. Am. Chem. Soc., 1999, 121, 6, 1365, https://doi.org/10.1021/ja983116s
. [all data]
Schutz and Wollrab A., 1988
Schutz, H.; Wollrab A.,
The significance of the retention index in toxicologic analysis II,
Pharmazie in unzerer Zeit, 1988, 17, 4, 97-101. [all data]
Ardrey and Moffat, 1981
Ardrey, R.E.; Moffat, A.C.,
Gas-liquid chromatographic retention indices of 1318 substances of toxicological interest on SE-30 or OV-1 stationary phase,
J. Chromatogr., 1981, 220, 3, 195-252, https://doi.org/10.1016/S0021-9673(00)81925-1
. [all data]