Cyclopent-3-ene, 1,1-dimethoxy-1-sila-
- Formula: C6H12O2Si
- Molecular weight: 144.2438
- IUPAC Standard InChIKey: RWBCRMOSJZITFJ-UHFFFAOYSA-N
- CAS Registry Number: 61667-33-2
- Chemical structure:
View 3d structure (requires JavaScript / HTML 5) - Other names: Silacyclopent-3-ene,1,1-dimethoxy-

Gas phase ion energetics data

Data compiled as indicated in comments:
LLK - Sharon G. Lias, Rhoda D. Levin, and Sherif A. Kafafi
Ionization energy determinations
IE (eV) | Method | Reference | Comment |
---|---|---|---|
9.59 | PE | Khvostenko, Zykov, et al., 1981 | Vertical value; LLK |

References

Khvostenko, Zykov, et al., 1981
Khvostenko, V.I.; Zykov, B.G.; Yuriev, V.P.; Mironov, V.F.; Kovel'zon, G.I.; Panasenko, A.A.; Sheludyakov, V.D.; Gailyunas, I.A.,
Study of d(π)-p(π) interaction in vinyl- and alkylsilicon-containing compounds by photoelectron spectroscopy,
J. Organomet. Chem., 1981, 218, 155. [all data]