Thiophene, 3-methyl-
- Formula: C5H6S
- Molecular weight: 98.166
- IUPAC Standard InChIKey: QENGPZGAWFQWCZ-UHFFFAOYSA-N
- CAS Registry Number: 616-44-4
- Chemical structure:
View 3d structure (requires JavaScript / HTML 5) - Other names: 3-Methylthiophene; 3-Thiotolene; Methyl-3-thiophene; β-Methylthiophene

Gas phase thermochemistry data

Data compiled by: Hussein Y. Afeefy, Joel F. Liebman, and Stephen E. Stein
Quantity | Value | Units | Method | Reference | Comment |
---|---|---|---|---|---|
ΔfH°gas | 19.74 ± 0.22 | kcal/mol | Ccr | McCullough, Sunner, et al., 1953 | Reanalyzed by Cox and Pilcher, 1970, Original value = 19.94 ± 0.23 kcal/mol |

Condensed phase thermochemistry data

Data compiled by: Hussein Y. Afeefy, Joel F. Liebman, and Stephen E. Stein
Quantity | Value | Units | Method | Reference | Comment |
---|---|---|---|---|---|
ΔfH°liquid | 10.29 ± 0.21 | kcal/mol | Ccr | McCullough, Sunner, et al., 1953 | Reanalyzed by Cox and Pilcher, 1970, Original value = 10.49 ± 0.20 kcal/mol |
Quantity | Value | Units | Method | Reference | Comment |
ΔcH°liquid | -829.45 ± 0.17 | kcal/mol | Ccr | McCullough, Sunner, et al., 1953 | Reanalyzed by Cox and Pilcher, 1970, Original value = -829.2 ± 0.0 kcal/mol |

Phase change data

Data compiled as indicated in comments:
BS - Robert L. Brown and Stephen E. Stein
TRC - Thermodynamics Research Center, NIST Boulder Laboratories, Chris Muzny director
AC - William E. Acree, Jr., James S. Chickos
DRB - Donald R. Burgess, Jr.
ALS - Hussein Y. Afeefy, Joel F. Liebman, and Stephen E. Stein
Quantity | Value | Units | Method | Reference | Comment |
---|---|---|---|---|---|
Tboil | 388.6 | K | N/A | Weast and Grasselli, 1989 | BS |
Tboil | 388.6 | K | N/A | Majer and Svoboda, 1985 | |
Tboil | 388.6 | K | N/A | Haines, Helm, et al., 1956 | Uncertainty assigned by TRC = 0.3 K; TRC |
Quantity | Value | Units | Method | Reference | Comment |
Tfus | 204.21 | K | N/A | Haines, Helm, et al., 1956 | Uncertainty assigned by TRC = 0.06 K; TRC |
Quantity | Value | Units | Method | Reference | Comment |
Ttriple | 204.19 | K | N/A | McCullough, Sunner, et al., 1953, 2 | Uncertainty assigned by TRC = 0.02 K; For pure sample by extrapolation of 1/f to 0; TRC |
Quantity | Value | Units | Method | Reference | Comment |
Tc | 610.8 | K | N/A | Majer and Svoboda, 1985 | |
Quantity | Value | Units | Method | Reference | Comment |
ΔvapH° | 9.431 | kcal/mol | N/A | Majer and Svoboda, 1985 | |
ΔvapH° | 9.44 | kcal/mol | N/A | Reid, 1972 | AC |
ΔvapH° | 9.44 | kcal/mol | N/A | McCullough, Sunner, et al., 1953 | DRB |
Reduced pressure boiling point
Tboil (K) | Pressure (atm) | Reference | Comment |
---|---|---|---|
387.2 | 0.971 | Aldrich Chemical Company Inc., 1990 | BS |
Enthalpy of vaporization
ΔvapH (kcal/mol) | Temperature (K) | Method | Reference | Comment |
---|---|---|---|---|
8.184 | 388.6 | N/A | Majer and Svoboda, 1985 | |
8.91 | 348. | N/A | Sapei, Uusi-Kyyny, et al., 2009 | Based on data from 333. to 388. K.; AC |
8.80 | 357. | N/A | Dykyj, Svoboda, et al., 1999 | Based on data from 326. to 398. K.; AC |
8.96 | 342. | A,EB | Stephenson and Malanowski, 1987 | Based on data from 327. to 399. K. See also White, Barnard--Smith, et al., 1952.; AC |
8.94 | 348. | I | Eon, Pommier, et al., 1971 | Based on data from 333. to 373. K. See also Boublik, Fried, et al., 1984.; AC |
9.45 | 329. | V | McCullough, Sunner, et al., 1953 | ALS |
Enthalpy of vaporization
ΔvapH =
A exp(-βTr) (1 − Tr)β
ΔvapH =
Enthalpy of vaporization (at saturation pressure)
(kcal/mol)
Tr = reduced temperature (T / Tc)
View plot Requires a JavaScript / HTML 5 canvas capable browser.
Temperature (K) | A (kcal/mol) | β | Tc (K) | Reference | Comment |
---|---|---|---|---|---|
329. to 389. | 13.15 | 0.288 | 610.8 | Majer and Svoboda, 1985 |
Antoine Equation Parameters
log10(P) = A − (B / (T + C))
P = vapor pressure (atm)
T = temperature (K)
View plot Requires a JavaScript / HTML 5 canvas capable browser.
Temperature (K) | A | B | C | Reference | Comment |
---|---|---|---|---|---|
333.4 to 373.5 | 4.65958 | 1697.518 | -23.456 | Eon, Pommier, et al., 1971 | Coefficents calculated by NIST from author's data. |
Enthalpy of fusion
ΔfusH (kcal/mol) | Temperature (K) | Reference | Comment |
---|---|---|---|
2.519 | 204.2 | Lange, 1985 | AC |

Reaction thermochemistry data

Data compiled by: John E. Bartmess
Individual Reactions
C5H5S- + =
By formula: C5H5S- + H+ = C5H6S
Quantity | Value | Units | Method | Reference | Comment |
---|---|---|---|---|---|
ΔrH° | 380.7 ± 3.1 | kcal/mol | G+TS | DePuy, Kass, et al., 1988 | gas phase; Acid: 3-methylthiophene. Between MeOH, EtOH. 1 D exchange implies ring proton as site. |
Quantity | Value | Units | Method | Reference | Comment |
ΔrG° | 373.0 ± 3.0 | kcal/mol | IMRB | DePuy, Kass, et al., 1988 | gas phase; Acid: 3-methylthiophene. Between MeOH, EtOH. 1 D exchange implies ring proton as site. |

Gas phase ion energetics data

Data compiled as indicated in comments:
B - John E. Bartmess
LLK - Sharon G. Lias, Rhoda D. Levin, and Sherif A. Kafafi
RDSH - Henry M. Rosenstock, Keith Draxl, Bruce W. Steiner, and John T. Herron
Ionization energy determinations
IE (eV) | Method | Reference | Comment |
---|---|---|---|
8.84 | CTS | Aloisi and Pignataro, 1973 | LLK |
8.72 | EI | Aloisi and Pignataro, 1973 | LLK |
8.40 | PE | Baker, Betteridge, et al., 1970 | RDSH |
8.70 | PE | Colonna, Distefano, et al., 1979 | Vertical value; LLK |
De-protonation reactions
C5H5S- + =
By formula: C5H5S- + H+ = C5H6S
Quantity | Value | Units | Method | Reference | Comment |
---|---|---|---|---|---|
ΔrH° | 380.7 ± 3.1 | kcal/mol | G+TS | DePuy, Kass, et al., 1988 | gas phase; Acid: 3-methylthiophene. Between MeOH, EtOH. 1 D exchange implies ring proton as site.; B |
Quantity | Value | Units | Method | Reference | Comment |
ΔrG° | 373.0 ± 3.0 | kcal/mol | IMRB | DePuy, Kass, et al., 1988 | gas phase; Acid: 3-methylthiophene. Between MeOH, EtOH. 1 D exchange implies ring proton as site.; B |

Kovats' RI, non-polar column, isothermal

Column type | Active phase | Temperature (C) | I | Reference | Comment |
---|---|---|---|---|---|
Capillary | SPB-1 | 100. | 776. | Misharina, Beletsky, et al., 1994 | 60. m/0.32 mm/0.25 μm |
Capillary | SE-30 | 100. | 775. | Golovnya, Misharina, et al., 1992 | 60. m/0.25 mm/0.50 μm, He |
Capillary | OV-101 | 100. | 775. | Golovnya, Misharina, et al., 1992 | 60. m/0.25 mm/0.50 μm, He |
Packed | Apiezon M | 130. | 807. | Garbuzov, Misharina, et al., 1985 | He or N2, Chromosorb W, AW-DMCS; Column length: 2.1 m |
Packed | Apiezon M | 130. | 807. | Golovnya, Garbuzov, et al., 1978 | Chromosorb W, AW/DMS; Column length: 2.1 m |

Kovats' RI, polar column, isothermal

Column type | Active phase | Temperature (C) | I | Reference | Comment |
---|---|---|---|---|---|
Capillary | Carbowax 40M | 100. | 1136. | Golovnya, Misharina, et al., 1992 | 50. m/0.32 mm/0.25 μm, He |

Kovats' RI, polar column, temperature ramp

Column type | Active phase | I | Reference | Comment |
---|---|---|---|---|
Capillary | DB-Wax | 1106. | Shimoda and Shibamoto, 1990 | He, 40. C @ 6. min, 3. K/min; Column length: 60. m; Column diameter: 0.25 mm; Tend: 190. C |

Van Den Dool and Kratz RI, non-polar column, temperature ramp

Column type | Active phase | I | Reference | Comment |
---|---|---|---|---|
Capillary | DB-5 | 786. | Methven L., Tsoukka M., et al., 2007 | 60. m/0.32 mm/1. μm, 40. C @ 2. min, 4. K/min, 260. C @ 10. min |
Capillary | DB-1 | 755. | Rochat S., de Saint Laumer J.Y., et al., 2007 | 20. m/0.18 mm/0.18 μm, 60. C @ 3. min, 8. K/min, 220. C @ 5. min |
Capillary | DB-1 | 763. | Rochat S., de Saint Laumer J.Y., et al., 2007 | 20. m/0.18 mm/0.18 μm, 60. C @ 3. min, 8. K/min, 220. C @ 5. min |
Capillary | HP-5 | 805. | Solina, Baumgartner, et al., 2005 | 25. m/0.2 mm/1. μm, He, 5. K/min, 280. C @ 5. min; Tstart: 40. C |
Capillary | HP-5 | 805. | Solina, Baumgartner, et al., 2005 | 25. m/0.2 mm/1. μm, He, 5. K/min, 280. C @ 5. min; Tstart: 40. C |
Capillary | DB-5 | 774. | Karagül-Yüceer, Cadwallader, et al., 2002 | 30. m/0.32 mm/0.25 μm, 35. C @ 5. min, 10. K/min, 200. C @ 30. min |
Capillary | DB-5 | 770. | Wu and Cadwallader, 2002 | 30. m/0.32 mm/0.25 μm, He, 40. C @ 5. min, 10. K/min, 220. C @ 30. min |
Capillary | BPX-5 | 783. | Ames, Guy, et al., 2001 | 50. m/0.32 mm/0.5 μm, He, 60. C @ 5. min, 4. K/min, 250. C @ 10. min |
Capillary | BPX-5 | 783. | Ames, Guy, et al., 2001 | 50. m/0.32 mm/0.5 μm, He, 60. C @ 5. min, 4. K/min, 250. C @ 10. min |
Capillary | DB-1 | 760. | Kim, 2001 | 60. m/0.32 mm/1. μm, He, 40. C @ 5. min, 2. K/min; Tend: 220. C |
Capillary | SPB-1 | 768. | Misharina, Beletsky, et al., 1994 | 60. m/0.32 mm/0.25 μm, 8. K/min; Tstart: 50. C; Tend: 200. C |
Capillary | OV-101 | 775. | Misharina, Golovnya, et al., 1993 | 50. m/0.32 mm/0.5 μm, He, 4. K/min; Tstart: 50. C; Tend: 200. C |
Capillary | OV-101 | 759. | Golovnya, Misharina, et al., 1992 | 60. m/0.25 mm/0.50 μm, He, 4. K/min; Tstart: 50. C; Tend: 200. C |

Van Den Dool and Kratz RI, non-polar column, custom temperature program

Column type | Active phase | I | Reference | Comment |
---|---|---|---|---|
Capillary | CP-Sil 8CB-MS | 782. | Elmore, Mottram, et al., 2000 | 60. m/0.25 mm/0.25 μm, He; Program: 0C(5min) => 40C/min => 40C (2min) => 4C/min => 280C |
Capillary | DB-5 | 794. | Parker, Hassell, et al., 2000 | 50. m/0.32 mm/0.5 μm, He; Program: oC(5min) => 60C/min => 60C (5min) => 4C/min => 250C |
Capillary | BPX-5 | 795. | Elmore, Mottram, et al., 1999 | 50. m/0.32 mm/0.5 μm, He; Program: 0C(5min) => 40C/min => 40C(2min) => 4C/min => 280C |

Van Den Dool and Kratz RI, polar column, temperature ramp

Column type | Active phase | I | Reference | Comment |
---|---|---|---|---|
Capillary | CP-Wax 52CB | 1115. | Mahadevan and Farmer, 2006 | 60. C @ 5. min, 4. K/min, 220. C @ 30. min; Column length: 50. m; Column diameter: 0.32 mm |
Capillary | DB-Wax | 1078. | Karagül-Yüceer, Cadwallader, et al., 2002 | 30. m/0.25 mm/0.25 μm, 35. C @ 5. min, 10. K/min, 200. C @ 30. min |
Capillary | DB-Wax | 1099. | Wu and Cadwallader, 2002 | 30. m/0.32 mm/1. μm, He, 40. C @ 5. min, 10. K/min, 200. C @ 30. min |
Capillary | DB-Wax | 1114. | Kim, 2001 | 60. m/0.25 mm/0.25 μm, He, 40. C @ 5. min, 2. K/min, 200. C @ 30. min |
Capillary | Supelcowax-10 | 1124. | Chung, 1999 | 60. m/0.25 mm/0.25 μm, He, 35. C @ 5. min, 2. K/min, 195. C @ 90. min |
Capillary | DB-Wax | 1121. | Shimoda, Shiratsuchi, et al., 1996 | 60. m/0.25 mm/0.25 μm, He, 2. K/min, 230. C @ 60. min; Tstart: 50. C |
Capillary | DB-Wax | 1117. | Chung, Eiserich, et al., 1994 | He, 60. C @ 4. min, 3. K/min, 220. C @ 30. min; Column length: 60. m; Column diameter: 0.25 mm |
Capillary | Carbowax 40M | 1130. | Golovnya, Misharina, et al., 1992 | 50. m/0.32 mm/0.25 μm, He, 4. K/min; Tstart: 50. C; Tend: 200. C |

Van Den Dool and Kratz RI, polar column, custom temperature program

Column type | Active phase | I | Reference | Comment |
---|---|---|---|---|
Capillary | Supelcowax-10 | 1120. | Bianchi, Careri, et al., 2007 | 30. m/0.25 mm/0.25 μm, He; Program: 35C(8min) => 4C/min => 60C => 6C/min => 160C => 20C/min => 200C(1min) |

Normal alkane RI, non-polar column, temperature ramp

Column type | Active phase | I | Reference | Comment |
---|---|---|---|---|
Capillary | HP-5 MS | 784. | Kotowska, Zalikowski, et al., 2012 | 30. m/0.25 mm/0.25 μm, Helium, 35. C @ 5. min, 3. K/min, 300. C @ 15. min |
Capillary | MDN-5 | 779. | van Loon, Linssen, et al., 2005 | 60. m/0.25 mm/0.25 μm, He, 40. C @ 4. min, 4. K/min, 270. C @ 5. min |
Capillary | PONA | 760. | Yang, Wang, et al., 2004 | 50. m/0.20 mm/0.50 μm, N2, 2. K/min; Tstart: 35. C; Tend: 170. C |
Capillary | PONA | 756. | Yang, Wang, et al., 2003 | 50. m/0.20 mm/0.50 μm, 2. K/min; Tstart: 30. C; Tend: 150. C |
Capillary | PONA | 759. | Yang, Yang, et al., 2003 | 50. m/0.20 mm/0.50 μm, Helium, 2. K/min; Tstart: 30. C; Tend: 170. C |
Capillary | SE-54 | 788. | Bellesia, Pinetti, et al., 2001 | 25. m/0.20 mm/0.50 μm, He, 35. C @ 2. min, 5. K/min; Tend: 250. C |
Capillary | DB-5MS | 779. | Cadwallader and Heo, 2001 | 30. m/0.53 mm/1.5 μm, He, 40. C @ 5. min, 6. K/min, 225. C @ 30. min |
Capillary | HP-5 | 811. | Kubec, Drhová, et al., 1999 | 30. m/0.25 mm/0.25 μm, N2, 40. C @ 3. min, 4. K/min, 240. C @ 10. min |
Capillary | HP-5 | 790. | Boylston and Viniyard, 1998 | 50. m/0.32 mm/0.52 μm, 35. C @ 15. min, 2. K/min, 250. C @ 45. min |
Capillary | DB-5 | 786. | Macku and Shibamoto, 1991 | He, 40. C @ 5. min, 2. K/min; Column length: 60. m; Column diameter: 0.25 mm; Tend: 160. C |
Capillary | CP-Sil 5 | 756. | Damste, van Dalen, et al., 1988 | 25. m/0.32 mm/0.45 μm, Helium, 0. C @ 5. min, 3. K/min; Tend: 300. C |
Capillary | CP-Sil 5 | 757. | Damste, van Dalen, et al., 1988 | 25. m/0.32 mm/0.45 μm, Helium, 0. C @ 5. min, 3. K/min; Tend: 300. C |
Capillary | CP Sil 5 CB | 756. | Damste, Kock-van Dalen, et al., 1988 | 25. m/0.32 mm/0.45 μm, He, 3. K/min; Tstart: 50. C; Tend: 300. C |
Capillary | CP Sil 5 CB | 757. | Damste, Kock-van Dalen, et al., 1988 | 25. m/0.32 mm/0.45 μm, He, 3. K/min; Tstart: 50. C; Tend: 300. C |

Normal alkane RI, non-polar column, custom temperature program

Column type | Active phase | I | Reference | Comment |
---|---|---|---|---|
Capillary | HP-5 MS | 786. | Kotowska, Zalikowski, et al., 2012 | 30. m/0.25 mm/0.25 μm, Helium; Program: not specified |
Capillary | VF-5 | 788. | Shivashankar, Roy, et al., 2012 | 30. m/0.25 mm/0.25 μm, Helium; Program: 50 0C (2 min) 3 0C/min -> 200 0C (3 min) 10 0C/min -> 220 0C (8 min) |
Capillary | VF-5 | 794. | Shivashankar, Roy, et al., 2012 | 30. m/0.25 mm/0.25 μm, Helium; Program: not specified |
Capillary | HP-5 | 767. | Rotsatschakul, Visesanguan, et al., 2009 | 60. m/0.25 mm/0.25 μm, Helium; Program: 30 0C (2 min) 2 0Cmin -> 60 0C 10 0C/min -> 100 0C 20 0C/min -> 140 0C 10 0C/min -> 200 0C (10 min) |
Capillary | SPB-5 | 780. | Begnaud, Pérès, et al., 2003 | 60. m/0.32 mm/1. μm; Program: not specified |
Capillary | BPX-5 | 772. | Machiels, van Ruth, et al., 2003 | 60. m/0.32 mm/1. μm, He; Program: 40C (4min) => 2C/min => 90C => 4C/min => 130C => 8C/min => 250 C (10min) |
Capillary | PONA | 759. | Yang, Wang, et al., 2003 | 50. m/0.20 mm/0.50 μm; Program: not specified |
Capillary | SE-30 | 773. | P'yanova, Zvereva, et al., 1987 | Column length: 25. m; Column diameter: 0.25 mm; Program: not specified |

Normal alkane RI, polar column, temperature ramp

Column type | Active phase | I | Reference | Comment |
---|---|---|---|---|
Capillary | HP-Innowax | 1101. | Puvipirom and Chaisei, 2012 | 15. m/0.32 mm/0.50 μm, Helium, 3. K/min; Tstart: 40. C; Tend: 250. C |
Capillary | HP-Wax | 1127. | Sanz, Maeztu, et al., 2002 | 60. m/0.25 mm/0.5 μm, He, 40. C @ 6. min, 3. K/min; Tend: 190. C |
Capillary | DB-Wax | 1110. | Cadwallader and Heo, 2001 | 30. m/0.53 mm/1. μm, He, 40. C @ 5. min, 6. K/min, 225. C @ 30. min |
Capillary | HP-Wax | 1127. | Sanz, Ansorena, et al., 2001 | 60. m/0.25 mm/0.5 μm, He, 40. C @ 6. min, 3. K/min; Tend: 190. C |
Capillary | Supelcowax-10 | 1130. | Girard and Durance, 2000 | 60. m/0.25 mm/0.25 μm, He, 35. C @ 10. min, 4. K/min; Tend: 200. C |
Capillary | HP-Innowax | 1123. | Kubec, Drhová, et al., 1999 | 30. m/0.25 mm/0.25 μm, He, 40. C @ 3. min, 4. K/min, 190. C @ 10. min |
Capillary | DB-Wax | 1120. | Umano, Hagi, et al., 1995 | He, 40. C @ 2. min, 2. K/min; Column length: 60. m; Column diameter: 0.25 mm; Tend: 200. C |
Capillary | Carbowax 20M | 1123. | Shibamoto and Russell, 1977 | 1. K/min; Column length: 100. m; Column diameter: 0.25 mm; Tstart: 70. C; Tend: 170. C |
Capillary | Carbowax 20M | 1127. | Shibamoto and Russell, 1977 | 1. K/min; Column length: 100. m; Column diameter: 0.25 mm; Tstart: 70. C; Tend: 170. C |
Capillary | Carbowax 20M | 1123. | Shibamoto and Russell, 1976 | N2, 1. K/min; Column length: 100. m; Column diameter: 0.25 mm; Tstart: 70. C; Tend: 170. C |
Capillary | Carbowax 20M | 1127. | Shibamoto and Russell, 1976 | N2, 1. K/min; Column length: 100. m; Column diameter: 0.25 mm; Tstart: 70. C; Tend: 170. C |

Normal alkane RI, polar column, custom temperature program

Column type | Active phase | I | Reference | Comment |
---|---|---|---|---|
Capillary | SOLGel-Wax | 1120. | Johanningsmeier and McFeeters, 2011 | 30. m/0.25 mm/0.25 μm, Helium; Program: 40 0C (2 min) 5 0C/min -> 140 0C 10 0C/min -> 250 0C (3 min) |
Capillary | SOLGel-Wax | 1120. | Johanningsmeier and McFeeters, 2011 | 30. m/0.25 mm/0.25 μm, Helium; Program: not specified |

References

McCullough, Sunner, et al., 1953
McCullough, J.P.; Sunner, S.; Finke, H.L.; Hubbard, W.N.; Gross, M.E.; Pennington, R.E.; Messerly, J.F.; Good, W.D.; Waddington, G.,
The chemical thermodynamic properties of 3-methylthiophene from 0 to 1000°K,
J. Am. Chem. Soc., 1953, 75, 5075-50. [all data]
Cox and Pilcher, 1970
Cox, J.D.; Pilcher, G.,
Thermochemistry of Organic and Organometallic Compounds, Academic Press, New York, 1970, 1-636. [all data]
Weast and Grasselli, 1989
CRC Handbook of Data on Organic Compounds, 2nd Editon, Weast,R.C and Grasselli, J.G., ed(s)., CRC Press, Inc., Boca Raton, FL, 1989, 1. [all data]
Majer and Svoboda, 1985
Majer, V.; Svoboda, V.,
Enthalpies of Vaporization of Organic Compounds: A Critical Review and Data Compilation, Blackwell Scientific Publications, Oxford, 1985, 300. [all data]
Haines, Helm, et al., 1956
Haines, W.E.; Helm, R.V.; Cook, G.L.; Ball, J.S.,
Purification and Properties of Organic Sulfur Compounds,
J. Phys. Chem., 1956, 60, 549-55. [all data]
McCullough, Sunner, et al., 1953, 2
McCullough, J.P.; Sunner, S.; Finke, H.L.; Hubbard, W.N.; Gross, M.E.; Pennington, R.E.; Messerly, J.F.; Good, W.D.; Waddington, G.,
The Chemical Thermodynamic Properties of 3-Methylthiophene from 0 to 1000 K,
J. Am. Chem. Soc., 1953, 75, 5075-81. [all data]
Reid, 1972
Reid, Robert C.,
Handbook on vapor pressure and heats of vaporization of hydrocarbons and related compounds, R. C. Wilhort and B. J. Zwolinski, Texas A Research Foundation. College Station, Texas(1971). 329 pages.$10.00,
AIChE J., 1972, 18, 6, 1278-1278, https://doi.org/10.1002/aic.690180637
. [all data]
Aldrich Chemical Company Inc., 1990
Aldrich Chemical Company Inc.,
Catalog Handbook of Fine Chemicals, Aldrich Chemical Company, Inc., Milwaukee WI, 1990, 1. [all data]
Sapei, Uusi-Kyyny, et al., 2009
Sapei, Erlin; Uusi-Kyyny, Petri; Keskinen, Kari I.; Aittamaa, Juhani,
Phase equilibria on four binary systems containing 3-methylthiophene,
Fluid Phase Equilibria, 2009, 279, 2, 81-86, https://doi.org/10.1016/j.fluid.2009.02.010
. [all data]
Dykyj, Svoboda, et al., 1999
Dykyj, J.; Svoboda, J.; Wilhoit, R.C.; Frenkel, M.L.; Hall, K.R.,
Vapor Pressure of Chemicals: Part A. Vapor Pressure and Antoine Constants for Hydrocarbons and Sulfur, Selenium, Tellurium and Hydrogen Containing Organic Compounds, Springer, Berlin, 1999, 373. [all data]
Stephenson and Malanowski, 1987
Stephenson, Richard M.; Malanowski, Stanislaw,
Handbook of the Thermodynamics of Organic Compounds, 1987, https://doi.org/10.1007/978-94-009-3173-2
. [all data]
White, Barnard--Smith, et al., 1952
White, P.T.; Barnard--Smith, D.G.; Fidler, F.A.,
Vapor Pressure--Temperature Relationships of Sulfur Compounds Related to Petroleum,
Ind. Eng. Chem., 1952, 44, 6, 1430-1438, https://doi.org/10.1021/ie50510a064
. [all data]
Eon, Pommier, et al., 1971
Eon, C.; Pommier, C.; Guiochon, G.,
Vapor pressures and second virial coefficients of some five-membered heterocyclic derivatives,
J. Chem. Eng. Data, 1971, 16, 4, 408-410, https://doi.org/10.1021/je60051a008
. [all data]
Boublik, Fried, et al., 1984
Boublik, T.; Fried, V.; Hala, E.,
The Vapour Pressures of Pure Substances: Selected Values of the Temperature Dependence of the Vapour Pressures of Some Pure Substances in the Normal and Low Pressure Region, 2nd ed., Elsevier, New York, 1984, 972. [all data]
Lange, 1985
Lange, N.A.,
Lange's Handbook of Chemistry, 13th Edition, J.A. Dean, ed(s)., McGraw-Hill, New York, NY, 1985, 1792. [all data]
DePuy, Kass, et al., 1988
DePuy, C.H.; Kass, S.R.; Bean, G.P.,
Formation and Reactions of Heteroaromatic Anions in the Gas Phase,
J. Org. Chem., 1988, 53, 19, 4427, https://doi.org/10.1021/jo00254a001
. [all data]
Aloisi and Pignataro, 1973
Aloisi, G.G.; Pignataro, S.,
Molecular complexes of substituted thiophens with σ and π acceptors,
J. Chem. Soc. Faraday Trans. 1, 1973, 69, 534. [all data]
Baker, Betteridge, et al., 1970
Baker, A.D.; Betteridge, D.; Kemp, N.R.; Kirby, R.E.,
Application of photoelectron spectrometry to pesticide analysis. Photoelectron spectra of fivemembered heterocycles and related molecules,
Anal. Chem., 1970, 42, 1064. [all data]
Colonna, Distefano, et al., 1979
Colonna, F.P.; Distefano, G.; Guerra, M.; Jones, D.; Modelli, A.,
Furyl- and thienyl-mercury derivatives studied by means of ultraviolet photoelectron spectroscopy. Evidence for the participation in bonding of the vacant 6p π orbitals of mercury in bis-2-furyl-bis-2-thienylmercury,
J. Chem. Soc. Dalton Trans., 1979, 2037. [all data]
Misharina, Beletsky, et al., 1994
Misharina, T.A.; Beletsky, I.V.; Golovnya, R.V.,
Chromatographic and IR characteristics of methyl-, formyl-, and acetyl-substituted furans and thiophenes,
Russ. Chem. Bull. (Engl. Transl.), 1994, 43, 1, 64-69, https://doi.org/10.1007/BF00699137
. [all data]
Golovnya, Misharina, et al., 1992
Golovnya, R.V.; Misharina, T.A.; Beletskiy, I.V.,
Influence of methyl, formyl and acetyl groups on retention of substituted furans and thiophenes in capillary GC,
Chromatographia, 1992, 34, 9/10, 497-501, https://doi.org/10.1007/BF02290243
. [all data]
Garbuzov, Misharina, et al., 1985
Garbuzov, V.G.; Misharina, T.A.; Aerov, A.F.; Golovnya, R.V.,
Gas chromatographic retention indices for sulphur(II)-containing organic substances,
J. Anal. Chem. USSR (Engl. Transl.), 1985, 40, 4, 576-586. [all data]
Golovnya, Garbuzov, et al., 1978
Golovnya, R.V.; Garbuzov, V.G.; Aerov, A.F.,
Gas chromatographic characterization of sulfur-containing compounds. 5. Thiophene, furan, and benzene derivatives,
Izv. Akad. Nauk SSSR Ser. Khim., 1978, 11, 2271-2274. [all data]
Shimoda and Shibamoto, 1990
Shimoda, M.; Shibamoto, T.,
Isolation and identification of headspace volatiles from brewed coffee with an on-column GC/MS method,
J. Agric. Food Chem., 1990, 38, 3, 802-804, https://doi.org/10.1021/jf00093a045
. [all data]
Methven L., Tsoukka M., et al., 2007
Methven L.; Tsoukka M.; Oruna-Concha M.J.; Parker J.K.; Mottram D.S.,
Influence of sulfur amino acids on the volatile and nonvolatile components of cooked salmon (Salmo salar),
J. Agric. Food Chem., 2007, 55, 4, 1427-1436, https://doi.org/10.1021/jf0625611
. [all data]
Rochat S., de Saint Laumer J.Y., et al., 2007
Rochat S.; de Saint Laumer J.Y.; Chaintreau A.,
Analysis of sulfur compounds from the in-oven roast beef aroma by comprehensive two-dimensional gas chromatography,
J. Chromatogr. A, 2007, 1147, 1, 85-94, https://doi.org/10.1016/j.chroma.2007.02.039
. [all data]
Solina, Baumgartner, et al., 2005
Solina, M.; Baumgartner, P.; Johnson, R.L.; Whitfield, F.B.,
Volatile aroma components of soy protein isolate and acid-hydrolysed vegetable protein,
Food Chem., 2005, 90, 4, 861-873, https://doi.org/10.1016/j.foodchem.2004.06.005
. [all data]
Karagül-Yüceer, Cadwallader, et al., 2002
Karagül-Yüceer, Y.; Cadwallader, K.R.; Drake, M.A.,
Volatile flavor components of stored nonfat dry milk,
J. Agric. Food Chem., 2002, 50, 2, 305-312, https://doi.org/10.1021/jf010648a
. [all data]
Wu and Cadwallader, 2002
Wu, Y.-F.G.; Cadwallader, K.R.,
Characterization of the aroma of a meatlike process flavoring from soybean-based enzyme-hydrolyzed vegetable protein,
J. Agric. Food Chem., 2002, 50, 10, 2900-2907, https://doi.org/10.1021/jf0114076
. [all data]
Ames, Guy, et al., 2001
Ames, J.M.; Guy, R.C.E.; Kipping, G.J.,
Effect of pH and temperature on the formation of volatile compounds in cysteine/reducing sugar/starch mixtures during extrusion cooking,
J. Agric. Food Chem., 2001, 49, 4, 1885-1894, https://doi.org/10.1021/jf0012547
. [all data]
Kim, 2001
Kim, J.S.,
Einfluss der Temperatur beim Rösten von Sesam auf Aroma und antioxidative Eigenschaften des Öls, PhD Thesis, Technischen Universität Berlin zur Erlangung des akademischen Grades, Berlin, 2001, 151. [all data]
Misharina, Golovnya, et al., 1993
Misharina, T.A.; Golovnya, R.V.; Beletsky, I.V.,
Sorption properties of heterocyclic compounds differing by heteroatom in capillary gas chromatography,
Russ. Chem. Bull. (Engl. Transl.), 1993, 42, 7, 1167-1170, https://doi.org/10.1007/BF00701998
. [all data]
Elmore, Mottram, et al., 2000
Elmore, J.S.; Mottram, D.S.; Enser, M.; Wood, J.D.,
The effects of diet and breed on the volatile compounds of cooked lamb,
Meat Sci., 2000, 55, 2, 149-159, https://doi.org/10.1016/S0309-1740(99)00137-0
. [all data]
Parker, Hassell, et al., 2000
Parker, J.K.; Hassell, G.M.E.; Mottram, D.S.; Guy, R.C.E.,
Sensory and instrumental analyses of volatiles generated during the extrusion cooking of oat flours,
J. Agric. Food Chem., 2000, 48, 8, 3497-3506, https://doi.org/10.1021/jf991302r
. [all data]
Elmore, Mottram, et al., 1999
Elmore, J.S.; Mottram, D.S.; Enser, M.; Wood, J.D.,
Effect of the polyunsaturated fatty acid composition of beef muscle on the profile of aroma volatiles,
J. Agric. Food Chem., 1999, 47, 4, 1619-1625, https://doi.org/10.1021/jf980718m
. [all data]
Mahadevan and Farmer, 2006
Mahadevan, K.; Farmer, L.,
Key Odor Impact Compounds in Three Yeast Extract Pastes,
J. Agric. Food Chem., 2006, 54, 19, 7242-7250, https://doi.org/10.1021/jf061102x
. [all data]
Chung, 1999
Chung, H.Y.,
Volatile components in crabmeats of Charybdis feriatus,
J. Agric. Food Chem., 1999, 47, 6, 2280-2287, https://doi.org/10.1021/jf981027t
. [all data]
Shimoda, Shiratsuchi, et al., 1996
Shimoda, M.; Shiratsuchi, H.; Nakada, Y.; Wu, Y.; Osajima, Y.,
Identification and sensory characterization of volatile flavor compounds in sesame seed oil,
J. Agric. Food Chem., 1996, 44, 12, 3909-3912, https://doi.org/10.1021/jf960115f
. [all data]
Chung, Eiserich, et al., 1994
Chung, T.Y.; Eiserich, J.P.; Shibamoto, T.,
Volatile compounds produced from peanut oil heated with different amounts of cysteine,
J. Agric. Food Chem., 1994, 42, 8, 1743-1746, https://doi.org/10.1021/jf00044a032
. [all data]
Bianchi, Careri, et al., 2007
Bianchi, F.; Careri, M.; Mangia, A.; Musci, M.,
Retention indices in the analysis of food aroma volatile compounds in temperature-programmed gas chromatography: Database creation and evaluation of precision and robustness,
J. Sep. Sci., 2007, 39, 4, 563-572, https://doi.org/10.1002/jssc.200600393
. [all data]
Kotowska, Zalikowski, et al., 2012
Kotowska, U.; Zalikowski, M.; Isidorov, V.A.,
HS-SPME/GC-MS analysis of volatile and semi-volatile organic compounds emitted from municipal sewage sludge,
Environ. Monit. Asses., 2012, 184, 5, 2893-2907, https://doi.org/10.1007/s10661-011-2158-8
. [all data]
van Loon, Linssen, et al., 2005
van Loon, W.A.M.; Linssen, J.P.H.; Legger, A.; Posthumus, M.A.; Voragen, A.G.J.,
Identification and olfactometry of French fries flavour extracted at mouth conditions,
Food Chem., 2005, 90, 3, 417-425, https://doi.org/10.1016/j.foodchem.2004.05.005
. [all data]
Yang, Wang, et al., 2004
Yang, Y.; Wang, Z.; Zong, B.; Yang, H.,
Determination of sulfur compounds in fluid catalytic cracking gasoline by gas chromatography with a sulfur chemiluminiscence detector,
Chin. J. Chromatogr., 2004, 22, 3, 216-219. [all data]
Yang, Wang, et al., 2003
Yang, Y.-T.; Wang, Z.; Han. J.-H.; Tian, H.-P.; Yang, H.-Y.,
Determination of sulfur compounds in gasoline fraction of microreactor products by gas chromatography - Atomic emission detector,
Petrochemical Technology (Shiyou Huagong), 2003, 32, 11, 995-998. [all data]
Yang, Yang, et al., 2003
Yang, Y.T.; Yang, H.Y.; Zong, B.N.; Lu, W.Z.,
determination and distribution of sulfur compounds in gasoline by gas chromatography-atomic emission detector,
Chinise J. Anal. Chem. (Fenxi Huaxue), 2003, 31, 10, 1153-1158. [all data]
Bellesia, Pinetti, et al., 2001
Bellesia, F.; Pinetti, A.; Tirillini, B.; Bianchi, A.,
Temperature-dependent evolution of volatile organic compounds in Tuber borchii from Italy,
Flavour Fragr. J., 2001, 16, 1, 1-6, https://doi.org/10.1002/1099-1026(200101/02)16:1<1::AID-FFJ936>3.0.CO;2-Y
. [all data]
Cadwallader and Heo, 2001
Cadwallader, K.R.; Heo, J.,
Aroma of roasted sesame oil: characterization by direct thermal desorption-gas chromatography-olfactometry and sample dilution analysis,
Am. Chem. Soc. Symp. Ser., 2001, 782, 187-202. [all data]
Kubec, Drhová, et al., 1999
Kubec, R.; Drhová, V.; Velísek, J.,
Volatile compounds thermally generated from S-propylcysteine and S-propylcysteine sulfoxide - aroma precursors of Allium vegetables,
J. Agric. Food Chem., 1999, 47, 3, 1132-1138, https://doi.org/10.1021/jf980974z
. [all data]
Boylston and Viniyard, 1998
Boylston, T.D.; Viniyard, B.T.,
Isolation of volatile flavor compounds from peanut butter using purge-and-trap technique
in Instrumental Methods in Food and Beverage Analysis, D. Wetzel and G. Charalambous, ed(s)., 1998, 225-243. [all data]
Macku and Shibamoto, 1991
Macku, C.; Shibamoto, T.,
Volatile sulfur-containing compounds generated from the thermal interaction of corn oil and cysteine,
J. Agric. Food Chem., 1991, 39, 11, 1987-1989, https://doi.org/10.1021/jf00011a021
. [all data]
Damste, van Dalen, et al., 1988
Damste, J.S.S.; van Dalen, A.C.K.; de Leeuw, J.W.; Schenck, P.A.,
Identification of homologous series of alkylated thiophenes, thiolanes, thianes and benzothiophenes present in pyrolisates of sulfur-rich kerogenes,
J. Chromatogr., 1988, 435, 435-452, https://doi.org/10.1016/S0021-9673(01)82208-1
. [all data]
Damste, Kock-van Dalen, et al., 1988
Damste, J.S.S.; Kock-van Dalen, A.C.; de Leeuw, J.W.; Schenk, P.A.,
Identification of homologous series of alkylated thiophenes, thiolanes, thianes and benzothiophenes present in pyrolysates of sulphur-rich kerogens,
J. Chromatogr., 1988, 435, 435-452, https://doi.org/10.1016/S0021-9673(01)82208-1
. [all data]
Shivashankar, Roy, et al., 2012
Shivashankar, S.; Roy, T.K.; Moorthy, P.N.R.,
Headspace solid phase micro extraction and GC/MS analysis of the volatile components in seed and cake of Azadirachta indica A. juss,
Chem. Bull. of Politechnika Univ. Timisoara, Romania, 2012, 57(71), 1, 1-6. [all data]
Rotsatschakul, Visesanguan, et al., 2009
Rotsatschakul, P.; Visesanguan, W.; Smitinont, T.; Chaiseri, S.,
Changes in volatile compounds during fermentation of nham (Thai fermented sausage),
Int. Food Res. J., 2009, 16, 391-414. [all data]
Begnaud, Pérès, et al., 2003
Begnaud, F.; Pérès, C.; Berdagué, J.-L.,
Characterization of volatile effluents of livestock buildings by solid-phase microextraction,
Int. J. Environ. Anal. Chem., 2003, 83, 10, 837-849, https://doi.org/10.1080/03067310310001603349
. [all data]
Machiels, van Ruth, et al., 2003
Machiels, D.; van Ruth, S.M.; Posthumus, M.A.; Istasse, L.,
Gas chromatography-olfactometry analysis of the volatile compounds of two commercial Irish beef meats,
Talanta, 2003, 60, 4, 755-764, https://doi.org/10.1016/S0039-9140(03)00133-4
. [all data]
P'yanova, Zvereva, et al., 1987
P'yanova, V.P.; Zvereva, M.N.; Tsypysheva, LG.; Portnova, T.V.; Kruglov, E.A.,
Investigating the products of thiophane synthesis, Abstr. IX All-Union Conference on Gas Chromatography, Kuibyshev State University, Kuibyshev, 1987, 308. [all data]
Puvipirom and Chaisei, 2012
Puvipirom, J.; Chaisei, S.,
Contribution of roasted grains and seeds in aroma of oleang (Thai coffee drink),
Int. Food Res. J., 2012, 19, 2, 583-588. [all data]
Sanz, Maeztu, et al., 2002
Sanz, C.; Maeztu, L.; Zapelena, M.J.; Bello, J.; Cid, C.,
Profiles of volatile compounds and sensory analysis of three blends of coffee: influence of different proportions of Arabica and Robusta and influence of roasting coffee with sugar,
J. Sci. Food Agric., 2002, 82, 8, 840-847, https://doi.org/10.1002/jsfa.1110
. [all data]
Sanz, Ansorena, et al., 2001
Sanz, C.; Ansorena, D.; Bello, J.; Cid, C.,
Optimizing headspace temperature and time sampling for identification of volatile compounds in ground roasted Arabica coffee,
J. Agric. Food Chem., 2001, 49, 3, 1364-1369, https://doi.org/10.1021/jf001100r
. [all data]
Girard and Durance, 2000
Girard, B.; Durance, T.,
Headspace volatiles of sockeye and pink salmon as affected by retort process,
Food Chem. Toxicol., 2000, 65, 1, 34-39. [all data]
Umano, Hagi, et al., 1995
Umano, K.; Hagi, Y.; Nakahara, K.; Shyoji, A.; Shibamoto, T.,
Volatile chemicals formed in the headspace of a heated D-glucose/L-cysteine Maillard model system,
J. Agric. Food Chem., 1995, 43, 8, 2212-2218, https://doi.org/10.1021/jf00056a046
. [all data]
Shibamoto and Russell, 1977
Shibamoto, T.; Russell, G.F.,
A study of the volatiles isolated from a D-glucose-hydrogen sulfide-ammonia model system,
J. Agric. Food Chem., 1977, 25, 1, 109-112, https://doi.org/10.1021/jf60209a054
. [all data]
Shibamoto and Russell, 1976
Shibamoto, T.; Russell, G.F.,
Study of meat volatiles associated with aroma generated in a D-glucose-hydrogen sulfide-ammonia model system,
J. Agric. Food Chem., 1976, 24, 4, 843-846, https://doi.org/10.1021/jf60206a047
. [all data]
Johanningsmeier and McFeeters, 2011
Johanningsmeier, S.D.; McFeeters, R.F.,
Detection of volatile spoilage metabolites in fermented cucumbers using nontargeted, comprehensive 2-dimensional gas chromatography-time-of-flight mass spectrometry (GCxGCxTOFMS),
J. Food Sci., 2011, 76, 1, c168-c177, https://doi.org/10.1111/j.1750-3841.2010.01918.x
. [all data]