Ethanamine, N-ethyl-N-methyl-
- Formula: C5H13N
- Molecular weight: 87.1634
- IUPAC Standard InChIKey: GNVRJGIVDSQCOP-UHFFFAOYSA-N
- CAS Registry Number: 616-39-7
- Chemical structure:

Condensed phase thermochemistry data

Data compiled by: Eugene S. Domalski and Elizabeth D. Hearing
Constant pressure heat capacity of liquid
Cp,liquid (cal/mol*K) | Temperature (K) | Reference |
---|---|---|
47.8 | 298.15 | Roux, Roberts, et al., 1980 |

Phase change data

Data compiled as indicated in comments:
TRC - Thermodynamics Research Center, NIST Boulder Laboratories, Chris Muzny director
BS - Robert L. Brown and Stephen E. Stein
AC - William E. Acree, Jr., James S. Chickos
Quantity | Value | Units | Method | Reference | Comment |
---|---|---|---|---|---|
Tboil | 338. ± 2. | K | AVG | N/A | Average of 10 values; Individual data points |
Quantity | Value | Units | Method | Reference | Comment |
ΔvapH° | 7.60 | kcal/mol | A | Stephenson and Malanowski, 1987 | Based on data from 283. to 339. K.; AC |

Gas phase ion energetics data

Data evaluated as indicated in comments:
HL - Edward P. Hunter and Sharon G. Lias
Data compiled as indicated in comments:
LLK - Sharon G. Lias, Rhoda D. Levin, and Sherif A. Kafafi
Quantity | Value | Units | Method | Reference | Comment |
---|---|---|---|---|---|
Proton affinity (review) | 232.1 | kcal/mol | N/A | Hunter and Lias, 1998 | HL |
Quantity | Value | Units | Method | Reference | Comment |
Gas basicity | 224.7 | kcal/mol | N/A | Hunter and Lias, 1998 | HL |
Ionization energy determinations
IE (eV) | Method | Reference | Comment |
---|---|---|---|
7.5 ± 0.1 | PE | Aue and Bowers, 1979 | LLK |
7.4 ± 0.1 | PE | Aue, Webb, et al., 1976 | LLK |
8.32 | PE | Utsunomiya, Kobayashi, et al., 1976 | Vertical value; LLK |

References

Roux, Roberts, et al., 1980
Roux, G.; Roberts, D.; Perron, G.; Desnoyers, J.E.,
Microheterogeneity in aqueous-organic solutions: heat capacities, volumes and expansibilities of some alcohols, aminoalcohol and tertiary amines in water,
J. Solution Chem., 1980, 9(9), 629-647. [all data]
Stephenson and Malanowski, 1987
Stephenson, Richard M.; Malanowski, Stanislaw,
Handbook of the Thermodynamics of Organic Compounds, 1987, https://doi.org/10.1007/978-94-009-3173-2
. [all data]
Hunter and Lias, 1998
Hunter, E.P.; Lias, S.G.,
Evaluated Gas Phase Basicities and Proton Affinities of Molecules: An Update,
J. Phys. Chem. Ref. Data, 1998, 27, 3, 413-656, https://doi.org/10.1063/1.556018
. [all data]
Aue and Bowers, 1979
Aue, D.H.; Bowers, M.T.,
Chapter 9. Stabilities of positive ions from equilibrium gas phase basicity measurements
in Ions Chemistry,, ed. M.T. Bowers, 1979. [all data]
Aue, Webb, et al., 1976
Aue, D.H.; Webb, H.M.; Bowers, M.T.,
Quantitative proton affinities, ionization potentials, and hydrogen affinities of alkylamines,
J. Am. Chem. Soc., 1976, 98, 311. [all data]
Utsunomiya, Kobayashi, et al., 1976
Utsunomiya, C.; Kobayashi, T.; Nagakura, S.,
Photoelectron spectra of electron donor-acceptor complexes between bromine and alkylamines,
Chem. Phys. Lett., 1976, 39, 245. [all data]