3-Pentanethiol
- Formula: C5H12S
- Molecular weight: 104.214
- IUPAC Standard InChIKey: WICKAMSPKJXSGN-UHFFFAOYSA-N
- CAS Registry Number: 616-31-9
- Chemical structure:
View 3d structure (requires JavaScript / HTML 5) - Other names: pentane-3-thiol

Phase change data

Data compiled as indicated in comments:
TRC - Thermodynamics Research Center, NIST Boulder Laboratories, Chris Muzny director
AC - William E. Acree, Jr., James S. Chickos
Quantity | Value | Units | Method | Reference | Comment |
---|---|---|---|---|---|
Tboil | 387.05 | K | N/A | Lanum and Morris, 1969 | Uncertainty assigned by TRC = 0.2 K; TRC |
Enthalpy of vaporization
ΔvapH (kJ/mol) | Temperature (K) | Reference | Comment |
---|---|---|---|
38.3 | 303. | Dykyj, Svoboda, et al., 1999 | Based on data from 288. to 413. K.; AC |

Gas phase ion energetics data

Data compiled by: Sharon G. Lias, Rhoda D. Levin, and Sherif A. Kafafi
Appearance energy determinations
Ion | AE (eV) | Other Products | Method | Reference | Comment |
---|---|---|---|---|---|
CH3S+ | 12.1 | C2H5+C2H4 | EI | Broer and Weringa, 1980 | |
C3H7S+ | 10.6 ± 0.15 | C2H5 | EI | Broer and Weringa, 1980 |

Kovats' RI, polar column, isothermal

Column type | Active phase | Temperature (C) | I | Reference | Comment |
---|---|---|---|---|---|
Capillary | PEG-20M | 93. | 979.5 | Morishita, Murakita, et al., 1985 | Column length: 50. m; Column diameter: 0.25 mm |
Capillary | PEG-20M | 80. | 973.9 | Morishita, Murakita, et al., 1982 | N2; Column length: 50. m; Column diameter: 0.25 mm |

Normal alkane RI, non-polar column, isothermal

Column type | Active phase | Temperature (C) | I | Reference | Comment |
---|---|---|---|---|---|
Capillary | DC-200 | 50. | 758. | Leppin, Gollnick, et al., 1969 | Argon; Column length: 100. m |

References

Lanum and Morris, 1969
Lanum, W.J.; Morris, J.C.,
Physical Properties of Some Sulfur and Nitrogen Compounds,
J. Chem. Eng. Data, 1969, 14, 93-8. [all data]
Dykyj, Svoboda, et al., 1999
Dykyj, J.; Svoboda, J.; Wilhoit, R.C.; Frenkel, M.L.; Hall, K.R.,
Vapor Pressure of Chemicals: Part A. Vapor Pressure and Antoine Constants for Hydrocarbons and Sulfur, Selenium, Tellurium and Hydrogen Containing Organic Compounds, Springer, Berlin, 1999, 373. [all data]
Broer and Weringa, 1980
Broer, W.J.; Weringa, W.D.,
Potential energy profiles for the unimolecular reactions of [C3H7S]+ ions,
Org. Mass Spectrom., 1980, 15, 229. [all data]
Morishita, Murakita, et al., 1985
Morishita, F.; Murakita, H.; Kojima, T.,
Prediction of retention indices of thiols and sulfides under different conditions of capillary gas chromatography,
Bunseki Kagaku, 1985, 34, 12, 800-802, https://doi.org/10.2116/bunsekikagaku.34.12_800
. [all data]
Morishita, Murakita, et al., 1982
Morishita, F.; Murakita, H.; Takemura, Y.; Kojima, T.,
Prediction of molecular structures of thiols and sulphides by retention indices,
J. Chromatogr., 1982, 239, 483-492, https://doi.org/10.1016/S0021-9673(00)82005-1
. [all data]
Leppin, Gollnick, et al., 1969
Leppin, E.; Gollnick, K.; Schomburg, G.,
Gas chromatographic identification of isomeric mercaptans,
Chromatographia, 1969, 2, 12, 535-540, https://doi.org/10.1007/BF02260096
. [all data]