2,5-Cyclohexadiene-1,4-dione, 2,5-dichloro-
- Formula: C6H2Cl2O2
- Molecular weight: 176.985
- IUPAC Standard InChIKey: LNXVNZRYYHFMEY-UHFFFAOYSA-N
- CAS Registry Number: 615-93-0
- Chemical structure:

Condensed phase thermochemistry data

Data compiled by: Hussein Y. Afeefy, Joel F. Liebman, and Stephen E. Stein
Quantity | Value | Units | Method | Reference | Comment |
---|---|---|---|---|---|
ΔfH°solid | -255. | kJ/mol | Ccb | Sjostrom, 1936 | At 318 K |
Quantity | Value | Units | Method | Reference | Comment |
ΔcH°solid | -2448.9 ± 8.4 | kJ/mol | Ccb | Smith, Bjellerup, et al., 1953 | Reanalyzed by Cox and Pilcher, 1970, Original value = -2451.1 ± 5.9 kJ/mol |
ΔcH°solid | -2443. | kJ/mol | Ccb | Sjostrom, 1936 | At 318 K |

Gas phase ion energetics data

Data compiled as indicated in comments:
LLK - Sharon G. Lias, Rhoda D. Levin, and Sherif A. Kafafi
B - John E. Bartmess
Electron affinity determinations
EA (eV) | Method | Reference | Comment |
---|---|---|---|
2.437 ± 0.061 | IMRE | Heinis, Chowdhury, et al., 1988 | ΔGea= -54.7 kcal/mol; ΔSea estimated = -3.5 eU; B |
2.372 ± 0.048 | IMRE | Fukuda and McIver, 1985 | ΔGea(355 K) = -53.5 kcal/mol; ΔSea =-3.5, est. from data in Heinis, Chowdhury, et al., 1988; B |
Ionization energy determinations
IE (eV) | Method | Reference | Comment |
---|---|---|---|
10.24 ± 0.03 | PI | Kotov and Potapov, 1972 | LLK |

References

Sjostrom, 1936
Sjostrom, Av.G.,
De klorsubstituerade kinonernas och hydrokinonernas termokemi,
Svensk. Kim. Tidr., 1936, 48, 121-124. [all data]
Smith, Bjellerup, et al., 1953
Smith, L.; Bjellerup, L.; Krook, S.; Westermark, H.,
Heats of combustion of organic chloro compounds determined by the "quartz wool" method,
Acta Chem. Scand., 1953, 7, 65. [all data]
Cox and Pilcher, 1970
Cox, J.D.; Pilcher, G.,
Thermochemistry of Organic and Organometallic Compounds, Academic Press, New York, 1970, 1-636. [all data]
Heinis, Chowdhury, et al., 1988
Heinis, T.; Chowdhury, S.; Scott, S.L.; Kebarle, P.,
Electron Affinities of Benzo-, Naphtho-, and Anthraquinones Determined from Gas-Phase Equilibria Measurements,
J. Am. Chem. Soc., 1988, 110, 2, 400, https://doi.org/10.1021/ja00210a015
. [all data]
Fukuda and McIver, 1985
Fukuda, E.K.; McIver, R.T., Jr.,
Relative electron affinities of substituted benzophenones, nitrobenzenes, and quinones. [Anchored to EA(SO2) from 74CEL/BEN],
J. Am. Chem. Soc., 1985, 107, 2291. [all data]
Kotov and Potapov, 1972
Kotov, B.V.; Potapov, V.K.,
Ionization potentials of strong organic electron acceptors,
Khim. Vys. Energ., 1972, 6, 375. [all data]