Benzene, 1-chloro-2-iodo-
- Formula: C6H4ClI
- Molecular weight: 238.453
- IUPAC Standard InChIKey: MPEOPBCQHNWNFB-UHFFFAOYSA-N
- CAS Registry Number: 615-41-8
- Chemical structure:
View 3d structure (requires JavaScript / HTML 5) - Other names: o-Chloroiodobenzene; o-Iodochlorobenzene; 1-Chloro-2-iodobenzene; 2-Chloroiodobenzene; 2-Chlorophenyl iodide; 2-Iodochlorobenzene

Phase change data

Data compiled by: Robert L. Brown and Stephen E. Stein
Quantity | Value | Units | Method | Reference | Comment |
---|---|---|---|---|---|
Tboil | 507.7 | K | N/A | Weast and Grasselli, 1989 |

Gas phase ion energetics data

Data compiled by: Henry M. Rosenstock, Keith Draxl, Bruce W. Steiner, and John T. Herron
Ionization energy determinations
IE (eV) | Method | Reference |
---|---|---|
8.4 ± 0.1 | PI | Watanabe, 1957 |

Kovats' RI, non-polar column, isothermal

Column type | Active phase | Temperature (C) | I | Reference | Comment |
---|---|---|---|---|---|
Packed | SE-30 | 160. | 1257. | Cook and Raushel, 1972 | He, Chromosorb W AW DMCS (80-100 mesh); Column length: 2. m |

Van Den Dool and Kratz RI, non-polar column, temperature ramp

Column type | Active phase | I | Reference | Comment |
---|---|---|---|---|
Capillary | OV-1 | 1205.9 | Gautzsch and Zinn, 1996 | 8. K/min; Tstart: 35. C; Tend: 300. C |
Capillary | OV-1 | 1205.9 | Gautzsch and Zinn, 1996 | 8. K/min; Tstart: 35. C; Tend: 300. C |

References

Weast and Grasselli, 1989
CRC Handbook of Data on Organic Compounds, 2nd Editon, Weast,R.C and Grasselli, J.G., ed(s)., CRC Press, Inc., Boca Raton, FL, 1989, 1. [all data]
Watanabe, 1957
Watanabe, K.,
Ionization potentials of some molecules,
J. Chem. Phys., 1957, 26, 542. [all data]
Cook and Raushel, 1972
Cook, L.E.; Raushel, F.M.,
Calculation of retention indices for benzene and benzene derivatives on the basis of molecular structure,
J. Chromatogr., 1972, 65, 3, 556-559, https://doi.org/10.1016/S0021-9673(00)85001-3
. [all data]
Gautzsch and Zinn, 1996
Gautzsch, R.; Zinn, P.,
Use of incremental models to estimate the retention indexes of aromatic compounds,
Chromatographia, 1996, 43, 3/4, 163-176, https://doi.org/10.1007/BF02292946
. [all data]