N-Chloromethylamine

Gas phase ion energetics data

Data compiled as indicated in comments:
LLK - Sharon G. Lias, Rhoda D. Levin, and Sherif A. Kafafi

Ionization energy determinations

IE (eV) Method Reference Comment
9.19 ± 0.02PEColbourne, Frost, et al., 1978LLK
9.70 ± 0.10PENagy-Felsobuki and Peel, 1978Vertical value; LLK

References

Colbourne, Frost, et al., 1978
Colbourne, D.; Frost, D.C.; McDowell, C.A.; Westwood, N.P.C., The photoelectron spectra of the chloramines NH2Cl, NHCl2, NCl3 and the methyl chloramines CH3NHCl, CH3NCl2, and (CH3)2NCl, J. Chem. Phys., 1978, 69, 1078. [all data]

Nagy-Felsobuki and Peel, 1978
Nagy-Felsobuki, E.; Peel, J.B., Photoelectron spectra of methylchloramine and methyldichloramine, J. Chem. Soc. Faraday Trans. 2, 1978, 74, 1927. [all data]