Benzenamine, 2-bromo-
- Formula: C6H6BrN
- Molecular weight: 172.023
- IUPAC Standard InChIKey: AOPBDRUWRLBSDB-UHFFFAOYSA-N
- CAS Registry Number: 615-36-1
- Chemical structure:
View 3d structure (requires JavaScript / HTML 5) - Other names: Aniline, o-bromo-; o-Aminobromobenzene; o-Bromoaniline; 2-Bromoaniline

Phase change data

Data compiled as indicated in comments:
BS - Robert L. Brown and Stephen E. Stein
AC - William E. Acree, Jr., James S. Chickos
Quantity | Value | Units | Method | Reference | Comment |
---|---|---|---|---|---|
Tboil | 502.2 | K | N/A | Weast and Grasselli, 1989 | BS |
Tboil | 502. | K | N/A | Buckingham and Donaghy, 1982 | BS |
Quantity | Value | Units | Method | Reference | Comment |
Tfus | 305. | K | N/A | Buckingham and Donaghy, 1982 | BS |
Tfus | 301.8 | K | N/A | Buckingham and Donaghy, 1982 | BS |
Quantity | Value | Units | Method | Reference | Comment |
ΔsubH° | 75.0 ± 1.4 | kJ/mol | C | Ribeiro da Silva, Ferreira, et al., 2006 | AC |
Reduced pressure boiling point
Tboil (K) | Pressure (bar) | Reference | Comment |
---|---|---|---|
411. to 414. | 0.064 to 0.071 | Buckingham and Donaghy, 1982 | BS |
Enthalpy of fusion
ΔfusH (kJ/mol) | Temperature (K) | Method | Reference | Comment |
---|---|---|---|---|
16.14 | 304.1 | DSC | Ribeiro da Silva, Ferreira, et al., 2006 | AC |
20.04 | 305. | N/A | Khanna, Khetarpal, et al., 1983 | AC |

Gas phase ion energetics data

Data compiled by: Sharon G. Lias, Rhoda D. Levin, and Sherif A. Kafafi
Ionization energy determinations
IE (eV) | Method | Reference |
---|---|---|
8.45 | EI | Baldwin, Loudon, et al., 1976 |
Appearance energy determinations
Ion | AE (eV) | Other Products | Method | Reference | Comment |
---|---|---|---|---|---|
C6H6N+ | 12.50 | Br | EI | Baldwin, Loudon, et al., 1976 |

Normal alkane RI, non-polar column, temperature ramp

Data compiled by: NIST Mass Spectrometry Data Center, William E. Wallace, director

Column type CapillaryCapillaryCapillary
Active phase TR-1TR-1Ultra-1
Column length (m) 30.30.25.
Carrier gas HeliumHeliumHe
Substrate
Column diameter (mm) 0.320.320.32
Phase thickness (μm) 0.250.250.25
Tstart (C) 50.50.80.
Tend (C) 300.300.260.
Heat rate (K/min) 5.5.3.
Initial hold (min)
Final hold (min)
I 1173.1173.1172.
ReferenceGruzdev, Alferova, et al., 2011Gruzdev, Filippova, et al., 2011Okumura, 1991
Comment MSDC-RI MSDC-RI MSDC-RI

Van Den Dool and Kratz RI, non-polar column, temperature ramp

Data compiled by: NIST Mass Spectrometry Data Center, William E. Wallace, director

Column type Capillary
Active phase OV-1
Column length (m)
Carrier gas
Substrate
Column diameter (mm)
Phase thickness (μm)
Tstart (C) 35.
Tend (C) 300.
Heat rate (K/min) 8.
Initial hold (min)
Final hold (min)
I 1178.5
ReferenceGautzsch and Zinn, 1996
Comment MSDC-RI

References

Weast and Grasselli, 1989
CRC Handbook of Data on Organic Compounds, 2nd Editon, Weast,R.C and Grasselli, J.G., ed(s)., CRC Press, Inc., Boca Raton, FL, 1989, 1. [all data]
Buckingham and Donaghy, 1982
Buckingham, J.; Donaghy, S.M.,
Dictionary of Organic Compounds: Fifth Edition, Chapman and Hall, New York, 1982, 1. [all data]
Ribeiro da Silva, Ferreira, et al., 2006
Ribeiro da Silva, Manuel A.V.; Ferreira, Ana I.M.C.L.; Gomes, José R.B.,
Experimental and Computational Study on the Thermochemistry of Bromoanilines,
Bull. Chem. Soc. Jpn., 2006, 79, 12, 1852-1859, https://doi.org/10.1246/bcsj.79.1852
. [all data]
Khanna, Khetarpal, et al., 1983
Khanna, M.S.; Khetarpal, S.C.; Lal, K.; Bhatnagar, H.L.,
Thermodynamic studies on melting of some o-, m-, and p-halogen derivatives of aniline,
Indian J. Pure Appl. Phys., 1983, 20, 6, 503. [all data]
Baldwin, Loudon, et al., 1976
Baldwin, M.A.; Loudon, A.G.; Maccoll, A.; Webb, K.S.,
The nature and fragmentation pathways of the molecular ions of some arylureas, arylthioureas, acetanilides, thioacetanilides and related compounds,
Org. Mass Spectrom., 1976, 11, 1181. [all data]