1H-Indole-3-ethanamine, N-methyl-
- Formula: C11H14N2
- Molecular weight: 174.2423
- IUPAC Standard InChIKey: NCIKQJBVUNUXLW-UHFFFAOYSA-N
- CAS Registry Number: 61-49-4
- Chemical structure:
View 3d structure (requires JavaScript / HTML 5) - Other names: Nω-Methyltryptamine; Indole, 3-(2-(methylamino)ethyl)-; Dipterine; 3-(2-(Methylamino)ethyl)indole; Methyltryptamine; N-Methyltryptamine; N-Monomethyltryptamine; 2-(1H-Indol-3-yl)-N-methylethanamine

Gas phase ion energetics data

Data compiled by: Sharon G. Lias, Rhoda D. Levin, and Sherif A. Kafafi
Ionization energy determinations
IE (eV) | Method | Reference | Comment |
---|---|---|---|
7.60 ± 0.08 | PE | Domelsmith, Munchausen, et al., 1977 | Vertical value |

Normal alkane RI, non-polar column, temperature ramp

Column type | Active phase | I | Reference | Comment |
---|---|---|---|---|
Packed | SE-30 | 1745. | Narasimhachari, Spaide, et al., 1971 | Column length: 2. m; Tstart: 140. C |

Normal alkane RI, non-polar column, custom temperature program

Column type | Active phase | I | Reference | Comment |
---|---|---|---|---|
Other | Methyl Silicone | 1770. | Ardrey and Moffat, 1981 | Program: not specified |

References

Domelsmith, Munchausen, et al., 1977
Domelsmith, L.N.; Munchausen, L.L.; Houk, K.N.,
Photoelectron spectra of psychotropic drugs. 1. Phenethylamines, tryptamines, and LSD,
J. Am. Chem. Soc., 1977, 99, 4311. [all data]
Narasimhachari, Spaide, et al., 1971
Narasimhachari, N.; Spaide, J.; Heller, B.,
Gas liquid chromatographic and mass spectrometric studies on trimethylsilyl derivatives of N-methyl- and N,N-dimethyltryptamines,
J. Chromatogr. Sci., 1971, 9, 8, 502-505, https://doi.org/10.1093/chromsci/9.8.502
. [all data]
Ardrey and Moffat, 1981
Ardrey, R.E.; Moffat, A.C.,
Gas-liquid chromatographic retention indices of 1318 substances of toxicological interest on SE-30 or OV-1 stationary phase,
J. Chromatogr., 1981, 220, 3, 195-252, https://doi.org/10.1016/S0021-9673(00)81925-1
. [all data]