Trimethyl lead bromide
- Formula: C3H9BrPb
- Molecular weight: 332.2
- IUPAC Standard InChIKey: WJDCKJMILIJQRF-UHFFFAOYSA-M
- CAS Registry Number: 6148-48-7
- Chemical structure:
View 3d structure (requires JavaScript / HTML 5) - Permanent link for this species. Use this link for bookmarking this species for future reference.

Gas phase ion energetics data

Data compiled as indicated in comments:
LLK - Sharon G. Lias, Rhoda D. Levin, and Sherif A. Kafafi
Ionization energy determinations
IE (eV) | Method | Reference | Comment |
---|---|---|---|
9.30 | PE | Flamini, Semprini, et al., 1976 | Vertical value; LLK |

References

Flamini, Semprini, et al., 1976
Flamini, A.; Semprini, E.; Stefani, F.; Sorriso, S.; Cardaci, G.,
He(I) photoelectron spectra and semiempirical molecular-orbital calculations on methylmetal halides of group 4A elements,
J. Chem. Soc. Dalton Trans., 1976, 731. [all data]