Acetamide, N-(2-hydroxyphenyl)-
- Formula: C8H9NO2
- Molecular weight: 151.1626
- IUPAC Standard InChIKey: ADVGKWPZRIDURE-UHFFFAOYSA-N
- CAS Registry Number: 614-80-2
- Chemical structure:
View 3d structure (requires JavaScript / HTML 5) - Other names: Acetanilide, 2'-hydroxy-; o-(Acetylamino)phenol; o-Acetamidophenol; o-Acetaminophenol; N-Acetyl-o-aminophenol; 2-(Acetylamino)phenol; 2-Acetamidophenol; 2-Acetaminophenol; 2'-Hydroxyacetanilide; o-Hydroxyacetanilide; Acet-o-aminofenol; N-Acetyl-2-aminophenol; Phenol, 2-acetamido-; o-Acetylaminofenol; 2-Hydroxyanilid kyseliny octove; 2-Hydroxyacetanilide; NSC 3989; N-(2-hydroxyphenyl)acetamide

Condensed phase thermochemistry data

Data compiled by: Eugene S. Domalski and Elizabeth D. Hearing
Constant pressure heat capacity of solid
Cp,solid (J/mol*K) | Temperature (K) | Reference | Comment |
---|---|---|---|
182.4 | 298. | Andrews, Lynn, et al., 1926 | T = 22 to 140 C. |

Phase change data

Data compiled as indicated in comments:
TRC - Thermodynamics Research Center, NIST Boulder Laboratories, Chris Muzny director
AC - William E. Acree, Jr., James S. Chickos
DH - Eugene S. Domalski and Elizabeth D. Hearing
Quantity | Value | Units | Method | Reference | Comment |
---|---|---|---|---|---|
Tfus | 364.50 | K | N/A | Andrews, Lynn, et al., 1926, 2 | Uncertainty assigned by TRC = 0.2 K; TRC |
Enthalpy of fusion
ΔfusH (kJ/mol) | Temperature (K) | Reference | Comment |
---|---|---|---|
21.25 | 364.5 | Domalski and Hearing, 1996 | AC |
21.250 | 364.5 | Andrews, Lynn, et al., 1926 | DH |
Entropy of fusion
ΔfusS (J/mol*K) | Temperature (K) | Reference | Comment |
---|---|---|---|
58.3 | 364.5 | Andrews, Lynn, et al., 1926 | DH |

Gas phase ion energetics data

Data compiled by: Sharon G. Lias, Rhoda D. Levin, and Sherif A. Kafafi
Ionization energy determinations
IE (eV) | Method | Reference |
---|---|---|
7.01 ± 0.02 | EI | Benezra and Bursey, 1972 |
Appearance energy determinations
Ion | AE (eV) | Other Products | Method | Reference | Comment |
---|---|---|---|---|---|
C6H6NO+ | 13.46 ± 0.02 | CH3CO | EI | Benezra and Bursey, 1972 | |
C6H7NO+ | 9.41 ± 0.02 | CH2=C=O | EI | Benezra and Bursey, 1972 |

References

Andrews, Lynn, et al., 1926
Andrews, D.H.; Lynn, G.; Johnston, J.,
The heat capacities and heat of crystallization of some isomeric aromatic compounds,
J. Am. Chem. Soc., 1926, 48, 1274-1287. [all data]
Andrews, Lynn, et al., 1926, 2
Andrews, D.H.; Lynn, G.; Johnston, J.,
The Heat Capacities and Heat of Crystallization of Some Isomeric Aromatic Compounds,
J. Am. Chem. Soc., 1926, 48, 1274. [all data]
Domalski and Hearing, 1996
Domalski, Eugene S.; Hearing, Elizabeth D.,
Heat Capacities and Entropies of Organic Compounds in the Condensed Phase. Volume III,
J. Phys. Chem. Ref. Data, 1996, 25, 1, 1, https://doi.org/10.1063/1.555985
. [all data]
Benezra and Bursey, 1972
Benezra, S.A.; Bursey, M.M.,
Hydrogen bonding in mass spectral activated complexes. A correction,
J. Chem. Soc. Perkin Trans. 2, 1972, 11, 1537. [all data]