o-tolylthiourea
- Formula: C8H10N2S
- Molecular weight: 166.243
- IUPAC Standard InChIKey: ACLZYRNSDLQOIA-UHFFFAOYSA-N
- CAS Registry Number: 614-78-8
- Chemical structure:
View 3d structure (requires JavaScript / HTML 5) - Other names: 1-(2-Methylphenyl)-2-thiourea

Gas phase ion energetics data

Data compiled by: Sharon G. Lias, Rhoda D. Levin, and Sherif A. Kafafi
Ionization energy determinations
IE (eV) | Method | Reference |
---|---|---|
8.20 | EI | Baldwin, Loudon, et al., 1976 |
Appearance energy determinations
Ion | AE (eV) | Other Products | Method | Reference | Comment |
---|---|---|---|---|---|
C7H7N2S+ | 9.60 | CH3 | EI | Baldwin, Loudon, et al., 1976 |

References

Baldwin, Loudon, et al., 1976
Baldwin, M.A.; Loudon, A.G.; Maccoll, A.; Webb, K.S.,
The nature and fragmentation pathways of the molecular ions of some arylureas, arylthioureas, acetanilides, thioacetanilides and related compounds,
Org. Mass Spectrom., 1976, 11, 1181. [all data]