Acetamide, N-(2-bromophenyl)-
- Formula: C8H8BrNO
- Molecular weight: 214.059
- IUPAC Standard InChIKey: VOBKUOHHOWQHFZ-UHFFFAOYSA-N
- CAS Registry Number: 614-76-6
- Chemical structure:
View 3d structure (requires JavaScript / HTML 5) - Other names: Acetanilide, 2'-bromo-; 2'-Bromoacetanilide; 2-Bromo-N-acetylaniline; o-Bromoacetanilide

Gas phase ion energetics data

Data compiled by: Sharon G. Lias, Rhoda D. Levin, and Sherif A. Kafafi
Ionization energy determinations
IE (eV) | Method | Reference |
---|---|---|
8.50 | EI | Baldwin, Loudon, et al., 1976 |
8.17 ± 0.03 | EI | Benezra and Bursey, 1971 |
Appearance energy determinations
Ion | AE (eV) | Other Products | Method | Reference | Comment |
---|---|---|---|---|---|
C2H3O+ | 14.68 ± 0.03 | ? | EI | Benezra and Bursey, 1971 | |
C6H6NBr+ | 11.17 ± 0.03 | CH2=C=O | EI | Benezra and Bursey, 1971 | |
C8H8NO+ | 9.40 | Br | EI | Baldwin, Loudon, et al., 1976 | |
C8H8NO+ | 9.08 ± 0.03 | Br | EI | Benezra and Bursey, 1971 |

References

Baldwin, Loudon, et al., 1976
Baldwin, M.A.; Loudon, A.G.; Maccoll, A.; Webb, K.S.,
The nature and fragmentation pathways of the molecular ions of some arylureas, arylthioureas, acetanilides, thioacetanilides and related compounds,
Org. Mass Spectrom., 1976, 11, 1181. [all data]
Benezra and Bursey, 1971
Benezra, S.A.; Bursey, M.M.,
ortho-Effects on ordering factors in mass spectral rearrangements. Loss of keten from halogenated phenyl acetates and acetanilides,
J. Chem. Soc. B, 1971, 1515. [all data]