10,10-Dimethylphenothiasilin
- Formula: C14H14SSi
- Molecular weight: 242.411
- CAS Registry Number: 61431-08-1

Gas phase ion energetics data

Data compiled as indicated in comments:
LBLHLM - Sharon G. Lias, John E. Bartmess, Joel F. Liebman, John L. Holmes, Rhoda D. Levin, and W. Gary Mallard
LLK - Sharon G. Lias, Rhoda D. Levin, and Sherif A. Kafafi
Ionization energy determinations
IE (eV) | Method | Reference | Comment |
---|---|---|---|
7.6 | PE | Traven', Redchenko, et al., 1982 | LBLHLM |
7.7 | PE | Traven', Redchenko, et al., 1981 | LLK |
7.8 ± 0.1 | EI | Innorta, Torroni, et al., 1977 | LLK |
7.85 | PE | Traven', Redchenko, et al., 1982 | Vertical value; LBLHLM |
7.85 | PE | Traven', Redchenko, et al., 1981 | Vertical value; LLK |
Appearance energy determinations
Ion | AE (eV) | Other Products | Method | Reference | Comment |
---|---|---|---|---|---|
C13H11SiS+ | 8.5 ± 0.1 | CH3 | EI | Innorta, Torroni, et al., 1977 | LLK |

References

Traven', Redchenko, et al., 1982
Traven', V.F.; Redchenko, V.V.; Stepanov, B.I.,
Parameterization of quantum-chemical calculations of organic compounds of silicon by means of photoelectron spectroscopy and the electronic spectroscopy of ctc,
J. Gen. Chem. USSR, 1982, 52, 2015, In original 2262. [all data]
Traven', Redchenko, et al., 1981
Traven', V.F.; Redchenko, V.V.; Eismont, M.Y.; Stepanov, B.I.,
Photoelectron spectra and electronic and steric structures of silicon and sulfur-containing analogs of 9,10-dihydroanthracene,
J. Gen. Chem. USSR, 1981, 51, 1099, In original 1297. [all data]
Innorta, Torroni, et al., 1977
Innorta, G.; Torroni, S.; Distefano, G.; Pietropaolo, D.; Ricci, A.,
Mass spectra and energetic data for the formation of the [M-CH3]+ ion of 10,10-dimethylphenylthio-silyn, -germyn and -stannyn derivatives and of 9,9-dimethylthioxantene,
Org. Mass Spectrom., 1977, 12, 766. [all data]