Benzenepropanenitrile, β-oxo-
- Formula: C9H7NO
- Molecular weight: 145.1580
- IUPAC Standard InChIKey: ZJRCIQAMTAINCB-UHFFFAOYSA-N
- CAS Registry Number: 614-16-4
- Chemical structure:
View 3d structure (requires JavaScript / HTML 5) - Other names: Acetonitrile, benzoyl-; α-Cyanoacetophenone; ω-Cyanoacetophenone; Acetophenone, 2-cyano-; Benzoylacetonitrile; Cyanoacetophenone; Cyanomethyl phenyl ketone; Hydrocinnamonitrile, β-oxo-; Phenacyl cyanide; 2-Cyanoacetophenone; 2-Cyanoacetyl phenone; 3-Phenyl-3-ketopropionitrile; 3-Oxo-3-phenylpropanenitrile; 3-Phenyl-3-oxopropanenitrile; NSC 4713

Gas phase thermochemistry data

Data compiled by: Hussein Y. Afeefy, Joel F. Liebman, and Stephen E. Stein
Quantity | Value | Units | Method | Reference | Comment |
---|---|---|---|---|---|
ΔfH°gas | 70.12 | kJ/mol | Ccb | Lebedeva, Dneprovskii, et al., 1969 | See Lebedeva, Rjadnenko, et al., 1969 |

Condensed phase thermochemistry data

Data compiled by: Hussein Y. Afeefy, Joel F. Liebman, and Stephen E. Stein
Quantity | Value | Units | Method | Reference | Comment |
---|---|---|---|---|---|
ΔfH°solid | -22.3 ± 0.42 | kJ/mol | Ccb | Lebedeva, Dneprovskii, et al., 1969 | See Lebedeva, Rjadnenko, et al., 1969 |
ΔfH°solid | 7.5 | kJ/mol | Ccb | Guinchant, 1918 | Author hf288_condensed[kcal/mol]=-3.6 kcal/mol |
Quantity | Value | Units | Method | Reference | Comment |
ΔcH°solid | -4519.72 ± 0.42 | kJ/mol | Ccb | Lebedeva, Dneprovskii, et al., 1969 | See Lebedeva, Rjadnenko, et al., 1969 |
ΔcH°solid | -4549.7 | kJ/mol | Ccb | Guinchant, 1918 | Author hf288_condensed[kcal/mol]=-3.6 kcal/mol |

Phase change data

Data compiled as indicated in comments:
BS - Robert L. Brown and Stephen E. Stein
ALS - Hussein Y. Afeefy, Joel F. Liebman, and Stephen E. Stein
AC - William E. Acree, Jr., James S. Chickos
Quantity | Value | Units | Method | Reference | Comment |
---|---|---|---|---|---|
ΔsubH° | 92.5 | kJ/mol | V | Lebedeva, Dneprovskii, et al., 1969 | See Lebedeva, Rjadnenko, et al., 1969; ALS |
Reduced pressure boiling point
Tboil (K) | Pressure (bar) | Reference | Comment |
---|---|---|---|
433.2 | 0.013 | Weast and Grasselli, 1989 | BS |
Enthalpy of sublimation
ΔsubH (kJ/mol) | Temperature (K) | Reference | Comment |
---|---|---|---|
99.8 | 325.5 | Stephenson and Malanowski, 1987 | Based on data from 318. to 333. K.; AC |

Reaction thermochemistry data

Data compiled by: John E. Bartmess
Individual Reactions
C9H6NO- + =
By formula: C9H6NO- + H+ = C9H7NO
Quantity | Value | Units | Method | Reference | Comment |
---|---|---|---|---|---|
ΔrG° | 1365. ± 8.4 | kJ/mol | IMRE | Taft, Abboud, et al., 1988 | gas phase; Revised 0.9 smaller: 91TAF |

Gas phase ion energetics data

Data compiled as indicated in comments:
B - John E. Bartmess
RDSH - Henry M. Rosenstock, Keith Draxl, Bruce W. Steiner, and John T. Herron
Ionization energy determinations
IE (eV) | Method | Reference | Comment |
---|---|---|---|
9.56 ± 0.05 | EI | Pignataro, Foffani, et al., 1966 | RDSH |
De-protonation reactions
C9H6NO- + =
By formula: C9H6NO- + H+ = C9H7NO
Quantity | Value | Units | Method | Reference | Comment |
---|---|---|---|---|---|
ΔrG° | 1365. ± 8.4 | kJ/mol | IMRE | Taft, Abboud, et al., 1988 | gas phase; Revised 0.9 smaller: 91TAF; B |

References

Lebedeva, Dneprovskii, et al., 1969
Lebedeva, N.D.; Dneprovskii, A.S.; Katin, Yu.A.,
Heats of combustion and enthalpies of formation of benzoyl cyanide, ω-cyanoacetophenone, and β-cyanopropiophenone,
Russ. J. Phys. Chem. (Engl. Transl.), 1969, 43, 770-773. [all data]
Lebedeva, Rjadnenko, et al., 1969
Lebedeva, N.D.; Rjadnenko, B.L.; Gutner, N.M.,
Heats of formation of some N-containing organic compounds,
Int. Conf. Calorim. Therm. (Warsaw, Poland), 1969, 1-8. [all data]
Guinchant, 1918
Guinchant, M.J.,
Etude sur la fonction acide dans les derives metheniques et methiniques,
Ann. Chem., 1918, 10, 30-84. [all data]
Weast and Grasselli, 1989
CRC Handbook of Data on Organic Compounds, 2nd Editon, Weast,R.C and Grasselli, J.G., ed(s)., CRC Press, Inc., Boca Raton, FL, 1989, 1. [all data]
Stephenson and Malanowski, 1987
Stephenson, Richard M.; Malanowski, Stanislaw,
Handbook of the Thermodynamics of Organic Compounds, 1987, https://doi.org/10.1007/978-94-009-3173-2
. [all data]
Taft, Abboud, et al., 1988
Taft, R.W.; Abboud, J.L.M.; Anvia, F.; Berthelot, M.; Fujio, M.; Gal, J.-F.; Headley, A.D.; Henderson, W.G.,
Regarding the Inherent Dependence of Resonance Effects of Strongly Conjugated Substituents on Electron Demand,
J. Am. Chem. Soc., 1988, 110, 6, 1797, https://doi.org/10.1021/ja00214a023
. [all data]
Pignataro, Foffani, et al., 1966
Pignataro, S.; Foffani, A.; Innorta, G.; Distefano, G.,
Molecular structural effects on the ionization potentials for metasubstituted aromatic compounds and for compounds of the type X-CH2-R,
Z. Physik. Chem. (Frankfurt), 1966, 49, 291. [all data]