Benzenamine, N-ethyl-N-methyl-
- Formula: C9H13N
- Molecular weight: 135.2062
- IUPAC Standard InChIKey: PPHQUIPUBYPZLD-UHFFFAOYSA-N
- CAS Registry Number: 613-97-8
- Chemical structure:
View 3d structure (requires JavaScript / HTML 5) - Other names: Aniline, N-ethyl-N-methyl-; N-Ethyl-N-methylaniline; N-Methyl-N-ethylaniline; (C2H5)N(CH3)-C6H5; Ethylmethylaniline; N-Ethyl-N-methylbenzenamine; Methylethyl aniline; Ethyl-methyl-phenyl-amine; N,N-Methyl-ethyl-aniline

Phase change data

Data compiled as indicated in comments:
BS - Robert L. Brown and Stephen E. Stein
TRC - Thermodynamics Research Center, NIST Boulder Laboratories, Chris Muzny director
Quantity | Value | Units | Method | Reference | Comment |
---|---|---|---|---|---|
Tboil | 477.2 | K | N/A | Weast and Grasselli, 1989 | BS |
Tboil | 475.15 | K | N/A | Brill, 1932 | Uncertainty assigned by TRC = 2. K; TRC |

Gas phase ion energetics data

Data evaluated as indicated in comments:
HL - Edward P. Hunter and Sharon G. Lias
Data compiled as indicated in comments:
RDSH - Henry M. Rosenstock, Keith Draxl, Bruce W. Steiner, and John T. Herron
Quantity | Value | Units | Method | Reference | Comment |
---|---|---|---|---|---|
Proton affinity (review) | 939.0 | kJ/mol | N/A | Hunter and Lias, 1998 | HL |
Quantity | Value | Units | Method | Reference | Comment |
Gas basicity | 912.4 | kJ/mol | N/A | Hunter and Lias, 1998 | HL |
Ionization energy determinations
IE (eV) | Method | Reference | Comment |
---|---|---|---|
7.37 | CTS | Farrell and Newton, 1965 | RDSH |

References

Weast and Grasselli, 1989
CRC Handbook of Data on Organic Compounds, 2nd Editon, Weast,R.C and Grasselli, J.G., ed(s)., CRC Press, Inc., Boca Raton, FL, 1989, 1. [all data]
Brill, 1932
Brill, H.C.,
Alkamine esters of aromatic acids: novocaine analogs: II,
J. Am. Chem. Soc., 1932, 54, 2484. [all data]
Hunter and Lias, 1998
Hunter, E.P.; Lias, S.G.,
Evaluated Gas Phase Basicities and Proton Affinities of Molecules: An Update,
J. Phys. Chem. Ref. Data, 1998, 27, 3, 413-656, https://doi.org/10.1063/1.556018
. [all data]
Farrell and Newton, 1965
Farrell, P.G.; Newton, J.,
Ionization potentials of aromatic amines,
J. Phys. Chem., 1965, 69, 3506. [all data]