Benzamide, N-methyl-
- Formula: C8H9NO
- Molecular weight: 135.1632
- IUPAC Standard InChIKey: NCCHARWOCKOHIH-UHFFFAOYSA-N
- CAS Registry Number: 613-93-4
- Chemical structure:
View 3d structure (requires JavaScript / HTML 5) - Other names: N-Methylbenzamide; N-Methylbenzenamide

Phase change data

Data compiled as indicated in comments:
BS - Robert L. Brown and Stephen E. Stein
TRC - Thermodynamics Research Center, NIST Boulder Laboratories, Chris Muzny director
AC - William E. Acree, Jr., James S. Chickos
Quantity | Value | Units | Method | Reference | Comment |
---|---|---|---|---|---|
Tfus | 352. | K | N/A | Saavedra, 1979 | Uncertainty assigned by TRC = 3. K; TRC |
Reduced pressure boiling point
Tboil (K) | Pressure (bar) | Reference | Comment |
---|---|---|---|
440.2 | 0.015 | Aldrich Chemical Company Inc., 1990 | BS |
437. to 438. | 0.020 | Frinton Laboratories Inc., 1986 | BS |
Enthalpy of sublimation
ΔsubH (kJ/mol) | Temperature (K) | Method | Reference | Comment |
---|---|---|---|---|
75.0 | 309. | A | Stephenson and Malanowski, 1987 | Based on data from 297. to 321. K. See also Aihara, 1955.; AC |
85.7 | 318. | A | Stephenson and Malanowski, 1987 | Based on data from 307. to 329. K. See also Aihara, 1960.; AC |

Gas phase ion energetics data

Data compiled by: Sharon G. Lias, Rhoda D. Levin, and Sherif A. Kafafi
Ionization energy determinations
IE (eV) | Method | Reference |
---|---|---|
9.33 ± 0.05 | EI | Thorstad, Undheim, et al., 1975 |

Normal alkane RI, non-polar column, custom temperature program

Column type | Active phase | I | Reference | Comment |
---|---|---|---|---|
Capillary | BPX-5 | 1390. | Machiels, van Ruth, et al., 2003 | 60. m/0.32 mm/1. μm, He; Program: 40C (4min) => 2C/min => 90C => 4C/min => 130C => 8C/min => 250 C (10min) |
Capillary | Polydimethyl siloxanes | 1404. | Zenkevich and Chupalov, 1996 | Program: not specified |

References

Saavedra, 1979
Saavedra, J.E.,
Reductdion of Nitrosoamides to Alcohols Using Sodium Borohydride,
J. Org. Chem., 1979, 44, 860-1. [all data]
Aldrich Chemical Company Inc., 1990
Aldrich Chemical Company Inc.,
Catalog Handbook of Fine Chemicals, Aldrich Chemical Company, Inc., Milwaukee WI, 1990, 1. [all data]
Frinton Laboratories Inc., 1986
Frinton Laboratories Inc.,
Catalog Number 11, Frinton Laboratories Inc., Vineland, NJ, 1986, 99. [all data]
Stephenson and Malanowski, 1987
Stephenson, Richard M.; Malanowski, Stanislaw,
Handbook of the Thermodynamics of Organic Compounds, 1987, https://doi.org/10.1007/978-94-009-3173-2
. [all data]
Aihara, 1955
Aihara, A.,
J. Chem. Soc. Jpn. Pure Chem. Sect., 1955, 76, 495. [all data]
Aihara, 1960
Aihara, Ariyuki,
Estimation of the Energy of Hydrogen Bonds Formed in Crystals. III. Amides,
Bull. Chem. Soc. Jpn., 1960, 33, 9, 1188-1194, https://doi.org/10.1246/bcsj.33.1188
. [all data]
Thorstad, Undheim, et al., 1975
Thorstad, O.; Undheim, K.; El-Gendy, M.A.F.,
Ionisation potentials in structure analysis of isomeric nitrones, oxaziranes, O-ether oximes acid amides,
Org. Mass Spectrom., 1975, 10, 1155. [all data]
Machiels, van Ruth, et al., 2003
Machiels, D.; van Ruth, S.M.; Posthumus, M.A.; Istasse, L.,
Gas chromatography-olfactometry analysis of the volatile compounds of two commercial Irish beef meats,
Talanta, 2003, 60, 4, 755-764, https://doi.org/10.1016/S0039-9140(03)00133-4
. [all data]
Zenkevich and Chupalov, 1996
Zenkevich, I.G.; Chupalov, A.A.,
New Possibilities of Chromato Mass Pectrometric Identification of Organic Compounds Using Increments of Gas Chromatographic Retention Indices of Molecular Structural Fragments,
Zh. Org. Khim. (Rus.), 1996, 32, 5, 656-666. [all data]