Benzenevanadium
- Formula: C6H6V
- Molecular weight: 129.0533
- IUPAC Standard InChIKey: WDLALBALDRYQNL-UHFFFAOYSA-N
- CAS Registry Number: 61332-91-0
- Chemical structure:
View 3d structure (requires JavaScript / HTML 5) - Permanent link for this species. Use this link for bookmarking this species for future reference.

Gas phase ion energetics data

Data compiled by: Henry M. Rosenstock, Keith Draxl, Bruce W. Steiner, and John T. Herron
Ionization energy determinations
IE (eV) | Method | Reference |
---|---|---|
6.3 ± 0.5 | EI | Muller and Goser, 1968 |

References

Muller and Goser, 1968
Muller, J.; Goser, P.,
Massenspektroskopische Untersuchungen an Ubergangsmetall-π-Komplexen mit funf-, sechs- und siebengliedrigen aromatischen Ringliganden,
J. Organometal. Chem., 1968, 12, 163. [all data]