Benzenamine, N,N-dibutyl-
- Formula: C14H23N
- Molecular weight: 205.3391
- IUPAC Standard InChIKey: FZPXKEPZZOEPGX-UHFFFAOYSA-N
- CAS Registry Number: 613-29-6
- Chemical structure:
View 3d structure (requires JavaScript / HTML 5) - Other names: Aniline, N,N-dibutyl-; Dibutylamine, N-phenyl-; Dibutylaniline; N,N-Dibutylaniline; N,N-di-n-Butylaniline; N-Phenyldibutylamine; N,N-Dibutylbenzenamine

Phase change data

Data compiled as indicated in comments:
BS - Robert L. Brown and Stephen E. Stein
TRC - Thermodynamics Research Center, NIST Boulder Laboratories, Chris Muzny director
Quantity | Value | Units | Method | Reference | Comment |
---|---|---|---|---|---|
Tboil | 542.7 | K | N/A | Aldrich Chemical Company Inc., 1990 | BS |
Tboil | 542.65 | K | N/A | Vogel, 1948 | Uncertainty assigned by TRC = 2. K; TRC |
Quantity | Value | Units | Method | Reference | Comment |
Tfus | 241.0 | K | N/A | Dreisbach, 1955 | Uncertainty assigned by TRC = 0.02 K; TRC |

Gas phase ion energetics data

Data compiled by: Henry M. Rosenstock, Keith Draxl, Bruce W. Steiner, and John T. Herron
Ionization energy determinations
IE (eV) | Method | Reference |
---|---|---|
6.95 | CTS | Farrell and Newton, 1965 |
7.15 | CTS | Briegleb and Czekalla, 1959 |

References

Aldrich Chemical Company Inc., 1990
Aldrich Chemical Company Inc.,
Catalog Handbook of Fine Chemicals, Aldrich Chemical Company, Inc., Milwaukee WI, 1990, 1. [all data]
Vogel, 1948
Vogel, A.I.,
Physical Properties and Chemical Constitution Part XXII. Some Primary Secondary and Tertiary Amines,
J. Chem. Soc., 1948, 1948, 1825. [all data]
Dreisbach, 1955
Dreisbach, R.R.,
Physical Properties of Chemical Compounds, Advances in Chemistry Series No. 15, Am. Chem. Soc.: Washington, D. C., 1955. [all data]
Farrell and Newton, 1965
Farrell, P.G.; Newton, J.,
Ionization potentials of aromatic amines,
J. Phys. Chem., 1965, 69, 3506. [all data]
Briegleb and Czekalla, 1959
Briegleb, G.; Czekalla, J.,
Die Bestimmung von lonisierungsenergien aus den Spektren von Elektronenubergangskomplexen,
Z.Elektrochem., 1959, 63, 6. [all data]