2-Tetrazene, 1,1,4,4-tetramethyl-
- Formula: C4H12N4
- Molecular weight: 116.1649
- IUPAC Standard InChIKey: PRGCYUAJTPIADR-UHFFFAOYSA-N
- CAS Registry Number: 6130-87-6
- Chemical structure:
View 3d structure (requires JavaScript / HTML 5) - Other names: Tetramethyl-2-tetrazene; Tetramethyltetrazene; Tetramethyltetrazone; 1,1,4,4-Tetramethyl-2-tetrazene; 1,1,4,4-Tetramethyltetrazene; (CH3)2NN=NN(CH3)2; NSC 38247; 2-Tetrazene, tetramethyl-

Condensed phase thermochemistry data

Data compiled by: Hussein Y. Afeefy, Joel F. Liebman, and Stephen E. Stein
Quantity | Value | Units | Method | Reference | Comment |
---|---|---|---|---|---|
ΔfH°liquid | 226.6 ± 1.8 | kJ/mol | Ccb | Donovan, Shomate, et al., 1960 | Reanalyzed by Cox and Pilcher, 1970, Original value = 231.5 kJ/mol |
Quantity | Value | Units | Method | Reference | Comment |
ΔcH°liquid | -3515.6 ± 1.8 | kJ/mol | Ccb | Donovan, Shomate, et al., 1960 | Reanalyzed by Cox and Pilcher, 1970, Original value = -3520.7 ± 0.88 kJ/mol |

Phase change data

Data compiled by: Hussein Y. Afeefy, Joel F. Liebman, and Stephen E. Stein
Quantity | Value | Units | Method | Reference | Comment |
---|---|---|---|---|---|
ΔvapH° | 44.1 ± 2.1 | kJ/mol | V | Donovan, Shomate, et al., 1960 | Reanalyzed by Cox and Pilcher, 1970, Original value = 43.51 kJ/mol |

Gas phase ion energetics data

Data compiled as indicated in comments:
LLK - Sharon G. Lias, Rhoda D. Levin, and Sherif A. Kafafi
RDSH - Henry M. Rosenstock, Keith Draxl, Bruce W. Steiner, and John T. Herron
Ionization energy determinations
IE (eV) | Method | Reference | Comment |
---|---|---|---|
7.0 | PE | Bischof, Gleiter, et al., 1975 | LLK |
7.7 | PE | Bischof, Gleiter, et al., 1975 | Vertical value; LLK |
Appearance energy determinations
Ion | AE (eV) | Other Products | Method | Reference | Comment |
---|---|---|---|---|---|
C2H6N+ | 9.9 ± 0.1 | ? | EI | Gowenlock, Jones, et al., 1961 | RDSH |
C2H6N3+ | 9.7 ± 0.1 | ? | EI | Gowenlock, Jones, et al., 1961 | RDSH |

Normal alkane RI, non-polar column, temperature ramp

Column type | Active phase | I | Reference | Comment |
---|---|---|---|---|
Capillary | OV-101 | 834. | Zenkevich, 2005 | 25. m/0.20 mm/0.10 μm, N2/He, 6. K/min; Tstart: 50. C; Tend: 250. C |

References

Donovan, Shomate, et al., 1960
Donovan, T.M.; Shomate, C.H.; McBride, W.R.,
The heat of combustion of tetramethyltetrazene and 1,1-dimethylhydrazine,
J. Phys. Chem., 1960, 64, 281-282. [all data]
Cox and Pilcher, 1970
Cox, J.D.; Pilcher, G.,
Thermochemistry of Organic and Organometallic Compounds, Academic Press, New York, 1970, 1-636. [all data]
Bischof, Gleiter, et al., 1975
Bischof, P.; Gleiter, R.; Dach, R.; Enders, D.; Seebach, D.,
Zur Wechselwirkung einsamer Elektronenpaare in Δ2 Tetrazenen. Photoelektronenspektroskopische Untersuchungen,
Tetrahedron, 1975, 31, 1415. [all data]
Gowenlock, Jones, et al., 1961
Gowenlock, B.G.; Jones, P.P.; Majer, J.R.,
Bond dissociation energies in some molecules containing alkyl substituted CH3, NH2, and OH,
J. Chem. Soc. Faraday Trans., 1961, 57, 23. [all data]
Zenkevich, 2005
Zenkevich, I.G.,
Experimentally measured retention indices., 2005. [all data]