Beryllium oxide
- Formula: Be6O6
- Molecular weight: 150.0695
- IUPAC Standard InChIKey: QRPNDIYNTUICCP-UHFFFAOYSA-N
- CAS Registry Number: 61279-76-3
- Chemical structure:
View 3d structure (requires JavaScript / HTML 5) - Species with the same structure:

Gas phase thermochemistry data

Quantity | Value | Units | Method | Reference | Comment |
---|---|---|---|---|---|
ΔfH°gas | -636.001 | kcal/mol | Review | Chase, 1998 | Data last reviewed in September, 1963 |
Quantity | Value | Units | Method | Reference | Comment |
S°gas,1 bar | 82.024 | cal/mol*K | Review | Chase, 1998 | Data last reviewed in September, 1963 |
Gas Phase Heat Capacity (Shomate Equation)
Cp° = A + B*t + C*t2 + D*t3 +
E/t2
H° − H°298.15= A*t + B*t2/2 +
C*t3/3 + D*t4/4 − E/t + F − H
S° = A*ln(t) + B*t + C*t2/2 + D*t3/3 −
E/(2*t2) + G
Cp = heat capacity (cal/mol*K)
H° = standard enthalpy (kcal/mol)
S° = standard entropy (cal/mol*K)
t = temperature (K) / 1000.
View plot Requires a JavaScript / HTML 5 canvas capable browser.
Temperature (K) | 298. to 600. | 600. to 6000. |
---|---|---|
A | -27.90590 | 63.92211 |
B | 271.0220 | 2.482061 |
C | -315.1329 | -0.581431 |
D | 138.3460 | 0.044923 |
E | 0.258332 | -4.901772 |
F | -636.3489 | -669.8951 |
G | -18.31360 | 135.8550 |
H | -636.0010 | -636.0010 |
Reference | Chase, 1998 | Chase, 1998 |
Comment | Data last reviewed in September, 1963 | Data last reviewed in September, 1963 |

Gas phase ion energetics data

Data compiled as indicated in comments:
RDSH - Henry M. Rosenstock, Keith Draxl, Bruce W. Steiner, and John T. Herron
Ionization energy determinations
IE (eV) | Method | Reference | Comment |
---|---|---|---|
~11. | EI | Chupka, Berkowitz, et al., 1959 | RDSH |

References

Chase, 1998
Chase, M.W., Jr.,
NIST-JANAF Themochemical Tables, Fourth Edition,
J. Phys. Chem. Ref. Data, Monograph 9, 1998, 1-1951. [all data]
Chupka, Berkowitz, et al., 1959
Chupka, W.A.; Berkowitz, J.; Giese, C.F.,
Vaporization of beryllium oxide and its reaction with tungsten,
J. Chem. Phys., 1959, 30, 827. [all data]