Beryllium oxide
- Formula: Be3O3
- Molecular weight: 75.0347
- IUPAC Standard InChIKey: QRPNDIYNTUICCP-UHFFFAOYSA-N
- CAS Registry Number: 61279-73-0
- Chemical structure:
View 3d structure (requires JavaScript / HTML 5) - Species with the same structure:

Gas phase thermochemistry data

Quantity | Value | Units | Method | Reference | Comment |
---|---|---|---|---|---|
ΔfH°gas | -252.000 | kcal/mol | Review | Chase, 1998 | Data last reviewed in September, 1963 |
Quantity | Value | Units | Method | Reference | Comment |
S°gas,1 bar | 65.330 | cal/mol*K | Review | Chase, 1998 | Data last reviewed in September, 1963 |
Gas Phase Heat Capacity (Shomate Equation)
Cp° = A + B*t + C*t2 + D*t3 +
E/t2
H° − H°298.15= A*t + B*t2/2 +
C*t3/3 + D*t4/4 − E/t + F − H
S° = A*ln(t) + B*t + C*t2/2 + D*t3/3 −
E/(2*t2) + G
Cp = heat capacity (cal/mol*K)
H° = standard enthalpy (kcal/mol)
S° = standard entropy (cal/mol*K)
t = temperature (K) / 1000.
View plot Requires a JavaScript / HTML 5 canvas capable browser.
Temperature (K) | 298. to 600. | 600. to 6000. |
---|---|---|
A | -1.107410 | 28.66979 |
B | 63.56329 | 2.111220 |
C | -45.00669 | -0.491855 |
D | 9.241011 | 0.037862 |
E | 0.095901 | -2.478590 |
F | -253.7940 | -267.8119 |
G | 47.49589 | 88.62450 |
H | -252.0000 | -252.0000 |
Reference | Chase, 1998 | Chase, 1998 |
Comment | Data last reviewed in September, 1963 | Data last reviewed in September, 1963 |

Gas phase ion energetics data

Data compiled as indicated in comments:
RDSH - Henry M. Rosenstock, Keith Draxl, Bruce W. Steiner, and John T. Herron
Ionization energy determinations
IE (eV) | Method | Reference | Comment |
---|---|---|---|
10.7 ± 0.4 | EI | Theard and Hildenbrand, 1964 | RDSH |
11.0 | EI | Chupka, Berkowitz, et al., 1959 | RDSH |

References

Chase, 1998
Chase, M.W., Jr.,
NIST-JANAF Themochemical Tables, Fourth Edition,
J. Phys. Chem. Ref. Data, Monograph 9, 1998, 1-1951. [all data]
Theard and Hildenbrand, 1964
Theard, L.P.; Hildenbrand, D.L.,
Heat of formation of Be2O(g) by mass spectrometry,
J. Chem. Phys., 1964, 41, 3416. [all data]
Chupka, Berkowitz, et al., 1959
Chupka, W.A.; Berkowitz, J.; Giese, C.F.,
Vaporization of beryllium oxide and its reaction with tungsten,
J. Chem. Phys., 1959, 30, 827. [all data]