Benzene, 2-ethoxy-1,3,5-trimethyl-
- Formula: C11H16O
- Molecular weight: 164.2441
- IUPAC Standard InChIKey: AFLXKLWQWMNDBE-UHFFFAOYSA-N
- CAS Registry Number: 61248-63-3
- Chemical structure:
View 3d structure (requires JavaScript / HTML 5) - Permanent link for this species. Use this link for bookmarking this species for future reference.

Gas phase ion energetics data

Data compiled as indicated in comments:
LLK - Sharon G. Lias, Rhoda D. Levin, and Sherif A. Kafafi
Ionization energy determinations
IE (eV) | Method | Reference | Comment |
---|---|---|---|
8.28 | PE | Friege and Klessinger, 1979 | Vertical value; LLK |

References

Friege and Klessinger, 1979
Friege, H.; Klessinger, M.,
Elektronenstruktur von Alkyl-aryl- und Alkyl-vinyl-ethern,
Chem. Ber., 1979, 112, 1614. [all data]