Benzonitrile, 2-nitro-
- Formula: C7H4N2O2
- Molecular weight: 148.1189
- IUPAC Standard InChIKey: SWBDKCMOLSUXRH-UHFFFAOYSA-N
- CAS Registry Number: 612-24-8
- Chemical structure:

Phase change data

Data compiled by: William E. Acree, Jr., James S. Chickos
Quantity | Value | Units | Method | Reference | Comment |
---|---|---|---|---|---|
ΔsubH° | 88.1 ± 1.4 | kJ/mol | ME | Roux, Jiménez, et al., 2003 | Based on data from 297. to 311. K. |
Enthalpy of sublimation
ΔsubH (kJ/mol) | Temperature (K) | Method | Reference | Comment |
---|---|---|---|---|
87.9 ± 1.4 | 304. | ME | Roux, Jiménez, et al., 2003 | Based on data from 297. to 311. K. |
Enthalpy of fusion
ΔfusH (kJ/mol) | Temperature (K) | Method | Reference |
---|---|---|---|
15.72 | 382.7 | DSC | Jiménez, Roux, et al., 2002 |

Reaction thermochemistry data

Data compiled as indicated in comments:
B - John E. Bartmess
M - Michael M. Meot-Ner (Mautner) and Sharon G. Lias
Individual Reactions
By formula: Br- + C7H4N2O2 = (Br- • C7H4N2O2)
Quantity | Value | Units | Method | Reference | Comment |
---|---|---|---|---|---|
ΔrH° | 87.4 ± 7.5 | kJ/mol | IMRE | Paul and Kebarle, 1991 | gas phase; ΔGaff at 423 K, ΔSaff taken as that of mCF3-nitrobenzene..Br-; B,M |
Quantity | Value | Units | Method | Reference | Comment |
ΔrS° | 92. | J/mol*K | N/A | Paul and Kebarle, 1991 | gas phase; Entropy change calculated or estimated; M |
Quantity | Value | Units | Method | Reference | Comment |
ΔrG° | 48.1 ± 4.2 | kJ/mol | IMRE | Paul and Kebarle, 1991 | gas phase; ΔGaff at 423 K, ΔSaff taken as that of mCF3-nitrobenzene..Br-; B |
Free energy of reaction
ΔrG° (kJ/mol) | T (K) | Method | Reference | Comment |
---|---|---|---|---|
48.1 | 423. | PHPMS | Paul and Kebarle, 1991 | gas phase; Entropy change calculated or estimated; M |

Gas phase ion energetics data

Data compiled as indicated in comments:
RDSH - Henry M. Rosenstock, Keith Draxl, Bruce W. Steiner, and John T. Herron
B - John E. Bartmess
Electron affinity determinations
EA (eV) | Method | Reference | Comment |
---|---|---|---|
1.61 ± 0.10 | IMRE | Chowdhury and Kebarle, 1986 | ΔGea(423 K) = -35.8 kcal/mol; ΔSea = -3.0 eu; B |
<1.980 ± 0.050 | PD | Mock and Grimsrud, 1989 | B |
Ionization energy determinations
IE (eV) | Method | Reference | Comment |
---|---|---|---|
10.52 ± 0.05 | EI | Buchs, 1970 | RDSH |

Ion clustering data

Data compiled as indicated in comments:
B - John E. Bartmess
M - Michael M. Meot-Ner (Mautner) and Sharon G. Lias
Clustering reactions
By formula: Br- + C7H4N2O2 = (Br- • C7H4N2O2)
Quantity | Value | Units | Method | Reference | Comment |
---|---|---|---|---|---|
ΔrH° | 87.4 ± 7.5 | kJ/mol | IMRE | Paul and Kebarle, 1991 | gas phase; ΔGaff at 423 K, ΔSaff taken as that of mCF3-nitrobenzene..Br-; B,M |
Quantity | Value | Units | Method | Reference | Comment |
ΔrS° | 92. | J/mol*K | N/A | Paul and Kebarle, 1991 | gas phase; Entropy change calculated or estimated; M |
Quantity | Value | Units | Method | Reference | Comment |
ΔrG° | 48.1 ± 4.2 | kJ/mol | IMRE | Paul and Kebarle, 1991 | gas phase; ΔGaff at 423 K, ΔSaff taken as that of mCF3-nitrobenzene..Br-; B |
Free energy of reaction
ΔrG° (kJ/mol) | T (K) | Method | Reference | Comment |
---|---|---|---|---|
48.1 | 423. | PHPMS | Paul and Kebarle, 1991 | gas phase; Entropy change calculated or estimated; M |

References

Roux, Jiménez, et al., 2003
Roux, Maria Victoria; Jiménez, Pilar; Dávalos, Juan Z.; Temprado, Manuel; Liebman, Joel F.,
Destabilization in the isomeric nitrobenzonitriles: an experimental thermochemical study,
The Journal of Chemical Thermodynamics, 2003, 35, 5, 803-811, https://doi.org/10.1016/S0021-9614(03)00017-X
. [all data]
Jiménez, Roux, et al., 2002
Jiménez, Pilar; Roux, Maria Victoria; Dávalos, Juán Z.; Temprado, Manuel,
Heat capacities and enthalpies of transitions of three nitrobenzonitriles,
Thermochimica Acta, 2002, 394, 1-2, 25-29, https://doi.org/10.1016/S0040-6031(02)00234-4
. [all data]
Paul and Kebarle, 1991
Paul, G.J.C.; Kebarle, P.,
Stabilities of Complexes of Br- with Substituted Benzenes (SB) Based on Determinations of the Gas-Phase Equilibria Br- + SB = (BrSB)-,
J. Am. Chem. Soc., 1991, 113, 4, 1148, https://doi.org/10.1021/ja00004a014
. [all data]
Chowdhury and Kebarle, 1986
Chowdhury, S.; Kebarle, P.,
Electron affinities of di- and tetracyanoethylene and cyanobenzenes based on measurements of gas-phase electron transfer equilibria,
J. Am. Chem. Soc., 1986, 108, 5453. [all data]
Mock and Grimsrud, 1989
Mock, R.S.; Grimsrud, E.P.,
Gas-Phase Electron Photodetachment Spectroscopy of the Molecular Anions of Nitroaromatic Hydrocarbons at Atmospheric Pressure,
J. Am. Chem. Soc., 1989, 111, 8, 2861, https://doi.org/10.1021/ja00190a020
. [all data]
Buchs, 1970
Buchs, A.,
Etude par spectrometrie de masse de l'ionisation de benzonitriles, de phenylacetonitriles et de N,N-dimethylanilines substitues,
Helv. Chim. Acta, 1970, 53, 2026. [all data]