Benzene, 1-ethyl-2-nitro-
- Formula: C8H9NO2
- Molecular weight: 151.1626
- IUPAC Standard InChIKey: PXWYZLWEKCMTEZ-UHFFFAOYSA-N
- CAS Registry Number: 612-22-6
- Chemical structure:
View 3d structure (requires JavaScript / HTML 5) - Other names: o-Ethylnitrobenzene; o-Nitroethylbenzene; 1-Ethyl-2-nitrobenzene; 2-Ethyl-1-nitrobenzene; 2-Ethylnitrobenzene

Phase change data

Data compiled as indicated in comments:
TRC - Thermodynamics Research Center, NIST Boulder Laboratories, Chris Muzny director
AC - William E. Acree, Jr., James S. Chickos
Quantity | Value | Units | Method | Reference | Comment |
---|---|---|---|---|---|
Tfus | 260.9 | K | N/A | Dreisbach, 1955 | Uncertainty assigned by TRC = 0.02 K; TRC |
Quantity | Value | Units | Method | Reference | Comment |
ΔvapH° | 63.0 ± 0.4 | kJ/mol | N/A | Verevkin and Heintz, 2000 | AC |
Enthalpy of vaporization
ΔvapH (kJ/mol) | Temperature (K) | Method | Reference | Comment |
---|---|---|---|---|
62.7 ± 0.4 | 303. | GS | Verevkin and Heintz, 2000 | Based on data from 284. to 323. K.; AC |
56.3 | 368. | A | Stephenson and Malanowski, 1987 | Based on data from 353. to 422. K.; AC |

Gas phase ion energetics data

Data compiled as indicated in comments:
LBLHLM - Sharon G. Lias, John E. Bartmess, Joel F. Liebman, John L. Holmes, Rhoda D. Levin, and W. Gary Mallard
Ionization energy determinations
IE (eV) | Method | Reference | Comment |
---|---|---|---|
9.39 ± 0.03 | EI | Baldwin, Carter, et al., 1982 | LBLHLM |

References

Dreisbach, 1955
Dreisbach, R.R.,
Physical Properties of Chemical Compounds, Advances in Chemistry Series No. 15, Am. Chem. Soc.: Washington, D. C., 1955. [all data]
Verevkin and Heintz, 2000
Verevkin, Sergey P.; Heintz, Andreas,
Thermochemistry of substituted benzenes: quantification of ortho-, para-, meta-, and buttress interactions in alkyl-substituted nitrobenzenes,
The Journal of Chemical Thermodynamics, 2000, 32, 9, 1169-1182, https://doi.org/10.1006/jcht.2000.0589
. [all data]
Stephenson and Malanowski, 1987
Stephenson, Richard M.; Malanowski, Stanislaw,
Handbook of the Thermodynamics of Organic Compounds, 1987, https://doi.org/10.1007/978-94-009-3173-2
. [all data]
Baldwin, Carter, et al., 1982
Baldwin, M.A.; Carter, D.M.; Gilmore, J.,
Loss of hydroxyl radical from isomeric ethylnitrobenzenes,
Org. Mass Spectrom., 1982, 17, 45. [all data]