Phosphinous chloride, methylene-
- Formula: CH2ClP
- Molecular weight: 80.453
- IUPAC Standard InChIKey: AWGNHJLEXUGMGT-UHFFFAOYSA-N
- CAS Registry Number: 61183-51-5
- Chemical structure:
View 3d structure (requires JavaScript / HTML 5) - Permanent link for this species. Use this link for bookmarking this species for future reference.

Gas phase ion energetics data

Data compiled by: Sharon G. Lias, John E. Bartmess, Joel F. Liebman, John L. Holmes, Rhoda D. Levin, and W. Gary Mallard
Ionization energy determinations
IE (eV) | Method | Reference | Comment |
---|---|---|---|
10.02 | PE | Bock and Bankmann, 1986 | Vertical value |

References

Bock and Bankmann, 1986
Bock, H.; Bankmann, M.,
H3C-P=CH2: An ylide with two-Coordinate phosphorus?,
Angew. Chem. Int. Ed. Engl., 1986, 25, 265. [all data]