3,4-Octadiene, 7,7-dimethyl-
- Formula: C10H18
- Molecular weight: 138.2499
- IUPAC Standard InChIKey: DPXVFALSMPSGEF-UHFFFAOYSA-N
- CAS Registry Number: 61129-34-8
- Chemical structure:
View 3d structure (requires JavaScript / HTML 5) - Other names: 7,7-Dimethyl-3,4-octadiene

Gas phase ion energetics data

Data compiled by: Henry M. Rosenstock, Keith Draxl, Bruce W. Steiner, and John T. Herron
Appearance energy determinations
Ion | AE (eV) | Other Products | Method | Reference | Comment |
---|---|---|---|---|---|
C3H5+ | 15.0 | ? | EI | Polyakova, Zimina, et al., 1960 | |
C4H9+ | 11.7 ± 0.05 | ? | EI | Polyakova, Zimina, et al., 1960 | |
C5H7+ | 13.5 | ? | EI | Polyakova, Zimina, et al., 1960 | |
C5H8+ | 12.6 | ? | EI | Polyakova, Zimina, et al., 1960 |

References

Polyakova, Zimina, et al., 1960
Polyakova, A.A.; Zimina, K.I.; Petrov, A.A.; Khmel'nitskii, R.A.,
Mass spectra and structure of some allenes,
Zh. Obshch. Khim., 1960, 30, 2977, In original 2949. [all data]