N-Methyl-o-toluidine
- Formula: C8H11N
- Molecular weight: 121.1796
- IUPAC Standard InChIKey: GUAWMXYQZKVRCW-UHFFFAOYSA-N
- CAS Registry Number: 611-21-2
- Chemical structure:
View 3d structure (requires JavaScript / HTML 5) - Other names: o-Toluidine, N-methyl-; N,2-Dimethylaniline; 2,N-Dimethylaniline; N,2-Dimethylbenzenamine; Benzenamine, N,2-dimethyl-

Phase change data

Data compiled by: Robert L. Brown and Stephen E. Stein
Quantity | Value | Units | Method | Reference | Comment |
---|---|---|---|---|---|
Tboil | 480.7 | K | N/A | Weast and Grasselli, 1989 |
Reduced pressure boiling point
Tboil (K) | Pressure (bar) | Reference |
---|---|---|
372.2 | 0.023 | Weast and Grasselli, 1989 |

Gas phase ion energetics data

Data compiled as indicated in comments:
LLK - Sharon G. Lias, Rhoda D. Levin, and Sherif A. Kafafi
RDSH - Henry M. Rosenstock, Keith Draxl, Bruce W. Steiner, and John T. Herron
Ionization energy determinations
IE (eV) | Method | Reference | Comment |
---|---|---|---|
7.27 | PE | Cowling and Johnstone, 1973 | LLK |
7.6 ± 0.1 | EI | Eland, Shepherd, et al., 1966 | RDSH |

References

Weast and Grasselli, 1989
CRC Handbook of Data on Organic Compounds, 2nd Editon, Weast,R.C and Grasselli, J.G., ed(s)., CRC Press, Inc., Boca Raton, FL, 1989, 1. [all data]
Cowling and Johnstone, 1973
Cowling, S.A.; Johnstone, R.A.W.,
Photoelectron spectroscopy: The effects of steric inhibition to resonance in anilines,
J. Electron Spectrosc. Relat. Phenom., 1973, 2, 161. [all data]
Eland, Shepherd, et al., 1966
Eland, J.H.D.; Shepherd, P.J.; Danby, C.J.,
Ionization potentials of aromatic molecules determined by analytical interpretation of electron impact data,
Z. Naturforsch., 1966, 21a, 1580. [all data]
Ramart-Lucas and Klein, 1949
Ramart-Lucas, M.; Klein, M.J.,
Deformation des orbites electroniques de l'azote dans les corps organiques (series des phenylhydrazones),
Bull. Soc. Chim. Fr., 1949, 16, 454-457. [all data]