Gold, compound with sodium(1:1)
- Formula: AuNa
- Molecular weight: 219.956338
- IUPAC Standard InChIKey: YENZGFYBFSDESL-UHFFFAOYSA-N
- CAS Registry Number: 61115-29-5
- Chemical structure:
View 3d structure (requires JavaScript / HTML 5) - Information on this page:

Gas phase ion energetics data

Data compiled by: Sharon G. Lias, Rhoda D. Levin, and Sherif A. Kafafi
Ionization energy determinations
IE (eV) | Method | Reference |
---|---|---|
8.5 ± 1.5 | EI | Piacente and Gingerich, 1977 |
6.2 | EI | Johnson, 1975 |
Appearance energy determinations
Ion | AE (eV) | Other Products | Method | Reference | Comment |
---|---|---|---|---|---|
Au+ | 7.8 | Na | EI | Johnson, 1975 |

References

Piacente and Gingerich, 1977
Piacente, V.; Gingerich, K.A.,
The mass spectrometric determination of the dissociation energies of the molecules NaAu and NaAg,
High Temp. Sci., 1977, 9, 189. [all data]
Johnson, 1975
Johnson, I.,
Mass spectrometric study of the vaporization of cesium and sodium molybdates,
J. Phys. Chem., 1975, 79, 722. [all data]