3,4-Octadiene, 2,2,7,7-tetramethyl-
- Formula: C12H22
- Molecular weight: 166.3031
- IUPAC Standard InChIKey: APIDJYHKQJDGMH-UHFFFAOYSA-N
- CAS Registry Number: 61092-76-0
- Chemical structure:
View 3d structure (requires JavaScript / HTML 5) - Other names: 2,2,7,7-Tetramethyl-3,4-octadiene

Gas phase ion energetics data

Data compiled by: Henry M. Rosenstock, Keith Draxl, Bruce W. Steiner, and John T. Herron
Appearance energy determinations
Ion | AE (eV) | Other Products | Method | Reference | Comment |
---|---|---|---|---|---|
C4H9+ | 11.6 ± 0.05 | ? | EI | Polyakova, Khmel'nitskii, et al., 1963 | |
C8H13+ | 10.0 ± 0.05 | ? | EI | Polyakova, Khmel'nitskii, et al., 1963 |

References

Polyakova, Khmel'nitskii, et al., 1963
Polyakova, A.A.; Khmel'nitskii, R.A.; Petrov, A.A.,
Mass spectra and the structure of organic compounds. VIII. Mass spectra of some allene hydrocarbons containing t-butyl groups,
Zh. Obshch. Khim., 1963, 33, 2518, In original 2455. [all data]