Anthracene, 1-hydroxy
- Formula: C14H10O
- Molecular weight: 194.2286
- IUPAC Standard InChIKey: MUVQKFGNPGZBII-UHFFFAOYSA-N
- CAS Registry Number: 610-50-4
- Chemical structure:

Gas phase ion energetics data

Data compiled by: Henry M. Rosenstock, Keith Draxl, Bruce W. Steiner, and John T. Herron
Ionization energy determinations
IE (eV) | Method | Reference |
---|---|---|
7.70 | EI | Gillis, Long, et al., 1968 |

References

Gillis, Long, et al., 1968
Gillis, R.G.; Long, G.J.; Moritz, A.G.; Occolowitz, J.L.,
Energetics of the electron-impact fragmentation of alkoxybenzenes and alkylthiobenzenes,
Org. Mass Spectrom., 1968, 1, 527. [all data]
Tichy M., 1967
Tichy M.,
UV atlas of organic compounds, 1967, 3, E2/10. [all data]