4a,8a-Ethanonaphthalene-9-one,1,4,5,8-tetrahydro-
- Formula: C12H14O
- Molecular weight: 174.2390
- IUPAC Standard InChIKey: YFGHTPCGOJCKMY-UHFFFAOYSA-N
- CAS Registry Number: 60964-67-2
- Chemical structure:
View 3d structure (requires JavaScript / HTML 5) - Permanent link for this species. Use this link for bookmarking this species for future reference.

Gas phase ion energetics data

Data compiled by: Sharon G. Lias, Rhoda D. Levin, and Sherif A. Kafafi
Ionization energy determinations
IE (eV) | Method | Reference | Comment |
---|---|---|---|
8.85 ± 0.05 | PE | Dougherty, Bloomfield, et al., 1976 | Vertical value |

References

Dougherty, Bloomfield, et al., 1976
Dougherty, D.; Bloomfield, J.J.; Newkome, G.R.; Arnett, J.F.; McGlynn, S.P.,
Photoelectron spectra of carbonyls. Propellenes and propellanones,
J. Phys. Chem., 1976, 80, 2212. [all data]